{"text_format":"1","workbook":"xlsx","n_sheets":3,"sheets":["高天井用LED器具(ｱｰﾑﾀｲﾌﾟ)","DATA","ｸﾞﾗﾌ"],"not_rendered":{"charts":1,"images":9,"macros":1,"external_links":1,"defined_names":111,"comments":0,"pivot_tables":0},"unopened":[],"bounds":{"document_bytes":16777216,"sheet_cells":100000,"rows_first":2000,"rows_last":500,"rows_between":2000,"halvings":0,"cell_chars":16384,"cell_head_chars":4096},"cells_cut":0,"cells_raw":0,"read":"whole","date_system":"1900"}

{"sheet":"高天井用LED器具(ｱｰﾑﾀｲﾌﾟ)","index":0,"n_rows":75,"n_cols":256,"rows_kept":75,"cut":false,"hidden":false,"merged":[[10,10,10,11],[16,10,16,11],[35,6,35,7],[14,6,14,7],[19,6,22,7],[27,6,27,7],[16,6,16,7],[18,8,18,11],[31,6,31,7],[47,2,47,3],[53,2,53,3],[54,5,56,5],[10,8,10,9],[41,8,41,9],[18,2,18,5],[38,4,38,5],[40,6,40,7],[25,6,25,7],[33,6,33,7],[54,4,56,4],[14,0,14,1],[10,6,13,6],[17,6,17,7],[29,6,29,7],[29,0,29,1],[10,0,13,1],[10,2,13,5],[15,0,15,1],[15,6,15,7],[16,0,16,1],[17,0,17,1],[25,0,25,1],[27,0,27,1],[18,0,18,1],[19,0,22,1],[0,0,0,11],[9,6,9,7],[9,0,9,1],[2,0,2,5],[2,6,2,11],[4,1,5,4],[9,2,9,5],[7,6,8,7],[7,2,8,5],[7,8,8,11],[1,0,1,11],[7,0,8,1],[9,8,9,11],[33,0,33,1],[18,6,18,7],[35,0,35,1],[31,0,31,1],[40,0,40,1],[38,0,38,1],[40,4,40,5],[38,6,38,7]]}
["省エネ計算ツール【高天井用ＬＥＤ器具（アームタイプ）】"]
["従来の高天井用器具と高天井用ＬＥＤ器具(アームタイプ）の省エネ試算ができます。目安としてご活用ください。"]
["従来の高天井用器具",null,null,null,null,null,"高天井用ＬＥＤ器具（アームタイプ）"]
["■従来の高天井用ランプを選んでください。↓（枠内から選択）",null,null,null,null,null,"■おすすめの高天井用ＬＥＤ器具です。"]
[null,"▼",null,null,null,"※1","特長","●アーム形状でさまざまな取り付けに対応"]
[null,null,null,null,null,null,null,"●171.8～175.7lm/Wの高効率と軽量化を実現"]
[null,null,null,null,null,null,null,"●LED光源寿命 60,000時間 ※4"]
["品　　名",null,{"$f":"IF((VLOOKUP(品名,DATA!$A$4:$AM$7,1,0))=\"▼\",\"\",VLOOKUP(品名,DATA!$A$4:$AM$7,1,0))","v":""},null,null,null,"品　　名",null,{"$f":"IF((VLOOKUP(品名,DATA!$A$4:$AM$7,23,0))=\"\",\"\",VLOOKUP(品名,DATA!$A$4:$AM$7,23,0))","v":""}]
[]
["参 考 形 式",null,{"$f":"IF(VLOOKUP(品名,DATA!$A$4:$AM$7,2,0)=\"\",\"\",VLOOKUP(品名,DATA!$A$4:$AM$7,2,0))","v":""},null,null,null,"形　　式",null,{"$f":"IF(VLOOKUP(品名,DATA!$A$4:$AM$7,24,0)=\"\",\"\",VLOOKUP(品名,DATA!$A$4:$AM$7,24,0))","v":""}]
["価 格\n（税抜）",null,"-",null,null,null,"価 格\n（税抜）",null,"<積算見積価格>※2",null,"<購入価格で試算>※3"]
[null,null,null,null,null,null,null,"LED器具",{"$f":"IF((VLOOKUP(品名,DATA!$A$4:$AM$7,27,0))=\"\",0,VLOOKUP(品名,DATA!$A$4:$AM$7,27,0))","v":0}," 円",0," 円"]
[null,null,null,null,null,null,null,"点灯装置",{"$f":"IF((VLOOKUP(品名,DATA!$A$4:$AM$7,28,0))=\"\",0,VLOOKUP(品名,DATA!$A$4:$AM$7,28,0))","v":0}," 円",0," 円"]
[null,null,null,null,null,null,null,"合計",{"$f":"IF(SUM(I12:I13)=\"\",\"\",SUM(I12:I13))","v":0}," 円",{"$f":"SUM(K12:K13)","v":0}," 円"]
["ランプ光束 ※5",null,{"$f":"IF((VLOOKUP(品名,DATA!$A$4:$AM$7,14,0))=\"\",\"\",VLOOKUP(品名,DATA!$A$4:$AM$7,14,0))","v":""}," lm",null,null,"定格光束 ※6",null,{"$f":"IF((VLOOKUP(品名,DATA!$A$4:$AM$7,33,0))=\"\",\"\",VLOOKUP(品名,DATA!$A$4:$AM$7,33,0))","v":""}," lm"]
["定格消費電力 ※7",null,{"$f":"IF((VLOOKUP(品名,DATA!$A$4:$AM$7,12,0))=\"\",\"\",VLOOKUP(品名,DATA!$A$4:$AM$7,12,0))","v":""}," W",null,null,"定格消費電力 ※7",null,{"$f":"IF((VLOOKUP(品名,DATA!$A$4:$AM$7,30,0))=\"\",\"\",VLOOKUP(品名,DATA!$A$4:$AM$7,30,0))","v":""}," W"]
["消費効率",null,{"$f":"IF(C15=\"\",\"\",ROUND(C15/C16,1))","v":""}," lm/W",null,null,"消費効率",null,{"$f":"IF(I15=\"\",\"\",ROUNDDOWN(I15/I16,1))","v":""}," lm/W","固有エネルギー消費効率"]
["ランプ寿命",null,{"$f":"IF((VLOOKUP(品名,DATA!$A$4:$AM$7,13,0))=\"\",\"\",VLOOKUP(品名,DATA!$A$4:$AM$7,13,0))","v":""}," 時間",null,null,"ＬＥＤ光源寿命",null,{"$f":"IF((VLOOKUP(品名,DATA!$A$4:$AM$7,32,0))=\"\",\"\",VLOOKUP(品名,DATA!$A$4:$AM$7,32,0))","v":""}," 時間","※4"]
["質量※8",null,{"$f":"IF((VLOOKUP(品名,DATA!$A$4:$AM$7,19,0))=\"\",\"\",VLOOKUP(品名,DATA!$A$4:$AM$7,19,0))","v":""},null,null,null,"質量",null,{"$f":"IF((VLOOKUP(品名,DATA!$A$4:$AM$7,38,0))=\"\",\"\",VLOOKUP(品名,DATA!$A$4:$AM$7,38,0))","v":""}]
["外観",null,null,null,null,null,"外観"]
[]
[]
[]
["■試算条件を入力ください。（枠内に入力ください）",null,null,null,null,null,"■試算条件を入力ください。（枠内に入力ください）"]
[]
["　使用台数",null,1," 台",null,null,"　使用台数",null,1," 台"]
[]
["　電力料金 ※9",null,28," 円/kWh","＊任意に変更ができます。",null,"　電力料金 ※9",null,{"$f":"C28","v":28}," 円/kWh"]
[]
["　1日の点灯時間",null,10," 時間/日",null,null,"　1日の点灯時間",null,{"$f":"C30","v":10}," 時間/日"]
[]
["　年間使用日数",null,300," 日/年",null,null,"　年間の使用日数",null,{"$f":"C32","v":300}," 日/年"]
[]
["　年間点灯時間※10",null,{"$f":"C30*C32","v":3000}," 時間/年",null,null,"　年間点灯時間",null,{"$f":"I30*I32","v":3000}," 時間/年"]
[]
["　年間消費電力",null,{"$f":"IF(C16=\"\",0,C16*C34*C26/1000)","v":0}," kWh/年",null,null,"　年間消費電力",null,{"$f":"IF(I16=\"\",0,I16*I26*I34/1000)","v":0}," kWh/年"]
[]
[]
["　ランニングコスト",null,{"$f":"C36*C28","v":0}," 円/年",null,null,"　ランニングコスト",null,{"$f":"I36*I28","v":0}," 円/年",{"$f":"IF(OR(C39=0,I39=0),\"-\",IF(((I39-C39)/C39)<0,ROUNDDOWN((I39-C39)/C39,2),ROUNDUP((I39-C39)/C39,2)))","v":"-"},{"$f":"IF(OR(K39=\"-\",K39=0),\"\",IF(K39<0,\"低減\",\"アップ\"))","v":""}]
["  (年間電力費）"]
[null,null,null,null,{"$f":"IF(C14=0,\"\",IF(J44>0,\"●設備費用なしの試算です！\",IF(E14=0,\"●積算見積価格の試算です！\",\"●購入価格の試算です！\")))","v":""},null,"　イニシャルコスト",null,{"$f":"IF(I14=0,0,IF(K14=0,I14*I26,K14*I26))","v":0}," 円",null,{"$f":"IF(OR(K41=\"-\",K41=0),\"\",IF(K41<0,\"低減\",\"アップ\"))","v":""}]
[null,null,null,null,null,null,null,null,{"$f":"IF(I14=0,\"\",IF(K14=0,\"●積算見積価格の試算です！\",\"●購入価格の試算です！\"))","v":""}]
[]
[]
[]
["■試算結果"]
["　【結果１】　ランニングコスト比較（年間電力費）"]
[null,null,"ランニングコスト",null,"比較"]
[null,"従来",{"$f":"IF(C39=\"\",0,ROUND(C39,0))","v":0}," 円/年",{"$f":"IF(C49=0,\"-\",100%)","v":"-"}]
[null,"ＬＥＤ",{"$f":"IF(I39=\"\",0,ROUND(I39,0))","v":0}," 円/年",{"$f":"IF(OR(C49=0,C50=0),\"-\",IF((C50/C49)<0,ROUNDDOWN((C50/C49),2),ROUNDUP((C50/C49),2)))","v":"-"}]
[null,"差額",{"$f":"C50-C49","v":0}," 円/年",{"$f":"IF(OR(C49=0,C51=0),\"-\",IF((C51/C49)<0,ROUNDDOWN((C51/C49),2),ROUNDUP((C51/C49),2)))","v":"-"}]
[null,{"$f":"IF(OR(C51=0,C51>0),\"\",\"●ＬＥＤなら年間 \"&TEXT(-C51,\"#,##0\")&\"円 お得です！\")","v":""}]
["　【結果２】　イニシャルコスト比較（設備費用）と設備償却"]
[null,null,"イニシャルコスト",null,"設備償却"]
[null,"従来",{"$f":"IF(C41=\"\",0,ROUND(C41,0))","v":0}," 円",{"$f":"IF(C57=0,\"\",-C57/C51)","v":""}]
[null,"ＬＥＤ",{"$f":"IF(I41=\"\",0,ROUND(I41,0))","v":0}," 円"]
[null,"差額",{"$f":"IF(C55=\"\",0,C56-C55)","v":0}," 円",null,null,"＊設備償却=イニシャルコスト差額÷ランニングコスト差額"]
["　＊イニシャルコストの設備償却は、従来の設備費用をランニングコストの差額で割り試算しています。　試算条件によっては、"]
["　　「一般社団法人日本照明工業会 ガイド111」による適正交換時期や耐用の限度を超える場合がありますが、寿命を保証するものではありません。"]
[]
{"$rows_left_out":16}
{"sheet":"DATA","index":1,"n_rows":22,"n_cols":39,"rows_kept":22,"cut":false,"hidden":true,"merged":[[1,22,1,38],[1,0,1,20]]}
["【DATA】"]
["従来器具",null,null,null,null,null,null,null,null,null,null,null,null,null,null,null,null,null,null,null,null,null,"提案ＬＥＤ器具"]
["従来品名","表示形式","従来形式","従来画像","表示器具","表示ランプ","表示安定器","従来器具","従来ランプ","従来安定器","合計価格","従来電力","定格寿命","ランプ光束","消費効率","質量合計","ランプ","点灯装置","質量表示","照度補正の場合","交換費@",null,"提案ＬＥＤ","提案表示形式","提案形式","提案画像","器具","点灯装置","合計価格","消費電力","平均電力","定格寿命","定格光束","消費効率","質量合計","ランプ","点灯装置","質量表示","照度補正の場合"]
["▼",null,"KUHAKU",null,null,null,null,null,null,null,null,null,null,null,null,null,null,null,null,null,null,null,null,null,"KUHAKULED"]
["水銀ランプ250W + 安定器","HF250X + 2.5MHC25/26","HF250X",null,null,"HF250X","2.5MHC25/26",{"$f":"Q10+Q12","v":8500},{"$f":"Q17","v":4600},{"$f":"Q13","v":15400},{"$f":"SUM(H5:J5)","v":28500},260,12000,12800,{"$f":"N5/L5","v":49.230769230769234},{"$f":"SUM(Q5:R5)","v":3.3000000000000003},0.2,3.1,"ﾗﾝﾌﾟ：0.2kg、安定器：3.1kg、合計：3.3kg",null,1100,null,"水銀ﾗﾝﾌﾟ250ｸﾗｽ 高天井用LED器具（広角）\n　+ 点灯装置","BME11BMNC1 + BK10CLN14C","BME1101MN",null,53400,23100,{"$f":"SUM(AA5:AB5)","v":76500},66.2,null,60000,11500,{"$f":"ROUNDDOWN(AG5/AD5,1)","v":173.7},{"$f":"SUM(AJ5:AK5)","v":2.7},1.3,1.4,"LED器具：1.3kg、点灯装置：1.4kg、合計：2.7kg"]
["水銀ランプ400W + 安定器","HF400X + 4MHC25/26","HF400X",null,null,"HF400X","4MHC25/26",{"$f":"Q10+Q12","v":8500},{"$f":"Q18","v":5850},{"$f":"Q14","v":20600},{"$f":"SUM(H6:J6)","v":34950},415,12000,22000,{"$f":"N6/L6","v":53.012048192771083},{"$f":"SUM(Q6:R6)","v":4.2699999999999996},0.27,4,"ﾗﾝﾌﾟ：0.27kg、安定器：4.0kg、合計：4.27kg",null,1100,null,"水銀ﾗﾝﾌﾟ400ｸﾗｽ 高天井用LED器具（広角）\n　+ 点灯装置","BME16CMNC1 + BK14CLN14C","BME1601MN",null,80600,33400,{"$f":"SUM(AA6:AB6)","v":114000},99,null,60000,17400,{"$f":"ROUNDDOWN(AG6/AD6,1)","v":175.7},{"$f":"SUM(AJ6:AK6)","v":2.7},1.3,1.4,"LEDﾗﾝﾌﾟ：1.3kg、点灯装置：1.4kg、合計：2.7kg"]
["ﾒﾀﾙﾊﾗｲﾄﾞﾗﾝﾌﾟ400W + 安定器","MF400L-B/BU-P + 4MHC25/26","MF400LB",null,null,"MF400L-B/BU-P","4MHC25/26",{"$f":"Q10+Q12","v":8500},{"$f":"Q21","v":13300},{"$f":"Q14","v":20600},42400,415,12000,42000,{"$f":"N7/L7","v":101.20481927710843},{"$f":"SUM(Q7:R7)","v":4.2699999999999996},0.27,4,"ﾗﾝﾌﾟ：0.27kg、安定器：4.0kg、合計：4.27kg",null,1100,null,"ﾒﾀﾙﾊﾗｲﾄﾞﾗﾝﾌﾟ400ｸﾗｽ 高天井用LED器具（広角）\n　+ 点灯装置","BME21CMNC1+ BK19CLN14C","BME2101MN",null,104500,37100,{"$f":"SUM(AA7:AB7)","v":141600},128,null,60000,22000,171.8,{"$f":"SUM(AJ7:AK7)","v":2.7},1.3,1.4,"LEDﾗﾝﾌﾟ：1.3kg、点灯装置：1.4kg、合計：3.3kg"]
[]
[null,null,null,"更新履歴",null,null,null,null,null,null,null,null,null,null,null,"＜質量＞","＜価格＞"]
[null,null,null,"■2018.5.31　従来器具の販売終了に伴い、経済比較から従来器具の価格を除外。",null,null,null,null,null,null,null,null,null,null,"MK4011",0.46,4800]
[null,null,null,"■2019.12.17　MC品にデータ更新（露出BOX用アダプタ別売、ランプ口出し線長さ変更）",null,null,null,null,null,null,null,null,null,null,"MK10011",0.82,9700]
[null,null,null,null,null,null,null,null,null,null,null,null,null,null,"MSN406",0.7,3700]
[null,null,null,null,null,null,null,null,null,null,null,null,null,null,"2.5MHC25",3.1,15400]
[null,null,null,null,null,null,null,null,null,null,null,null,null,null,"4MHC25",4,20600]
[null,null,null,null,null,null,null,null,null,null,null,null,null,null,"7MHC25",7.1,32400]
[null,null,null,null,null,null,null,null,null,null,null,null,null,null,"10MHC25",8.9,39500]
[null,null,null,null,null,null,null,null,null,null,null,null,null,null,"HF250X",0.2,4600]
[null,null,null,null,null,null,null,null,null,null,null,null,null,null,"HF400X",0.27,5850]
[null,null,null,null,null,null,null,null,null,null,null,null,null,null,"HF700X",0.44,10300]
[null,null,null,null,null,null,null,null,null,null,null,null,null,null,"HF1000X",0.56000000000000005,14400]
[null,null,null,null,null,null,null,null,null,null,null,null,null,null,"MF400L-B",0.27,13300]
[null,null,null,null,null,null,null,null,null,null,null,null,null,null,"MF1000L-C",0.59,28600]

{"sheet":"ｸﾞﾗﾌ","index":2,"n_rows":5,"n_cols":17,"rows_kept":5,"cut":false,"hidden":true,"merged":[]}
[]
[]
["使用年数",0,1,2,3,4,5,6,7,8,9,10,11,12,13,14,15]
["従来",{"$f":"IF('高天井用LED器具(ｱｰﾑﾀｲﾌﾟ)'!C41=\"\",0,'高天井用LED器具(ｱｰﾑﾀｲﾌﾟ)'!C41/10000)","v":0},{"$f":"IF('高天井用LED器具(ｱｰﾑﾀｲﾌﾟ)'!$C39=\"\",\"\",B4+'高天井用LED器具(ｱｰﾑﾀｲﾌﾟ)'!$C39/10000)","v":0},{"$f":"IF('高天井用LED器具(ｱｰﾑﾀｲﾌﾟ)'!$C39=\"\",\"\",C4+'高天井用LED器具(ｱｰﾑﾀｲﾌﾟ)'!$C39/10000)","v":0},{"$f":"IF('高天井用LED器具(ｱｰﾑﾀｲﾌﾟ)'!$C39=\"\",\"\",D4+'高天井用LED器具(ｱｰﾑﾀｲﾌﾟ)'!$C39/10000)","v":0},{"$f":"IF('高天井用LED器具(ｱｰﾑﾀｲﾌﾟ)'!$C39=\"\",\"\",E4+'高天井用LED器具(ｱｰﾑﾀｲﾌﾟ)'!$C39/10000)","v":0},{"$f":"IF('高天井用LED器具(ｱｰﾑﾀｲﾌﾟ)'!$C39=\"\",\"\",F4+'高天井用LED器具(ｱｰﾑﾀｲﾌﾟ)'!$C39/10000)","v":0},{"$f":"IF('高天井用LED器具(ｱｰﾑﾀｲﾌﾟ)'!$C39=\"\",\"\",G4+'高天井用LED器具(ｱｰﾑﾀｲﾌﾟ)'!$C39/10000)","v":0},{"$f":"IF('高天井用LED器具(ｱｰﾑﾀｲﾌﾟ)'!$C39=\"\",\"\",H4+'高天井用LED器具(ｱｰﾑﾀｲﾌﾟ)'!$C39/10000)","v":0},{"$f":"IF('高天井用LED器具(ｱｰﾑﾀｲﾌﾟ)'!$C39=\"\",\"\",I4+'高天井用LED器具(ｱｰﾑﾀｲﾌﾟ)'!$C39/10000)","v":0},{"$f":"IF('高天井用LED器具(ｱｰﾑﾀｲﾌﾟ)'!$C39=\"\",\"\",J4+'高天井用LED器具(ｱｰﾑﾀｲﾌﾟ)'!$C39/10000)","v":0},{"$f":"IF('高天井用LED器具(ｱｰﾑﾀｲﾌﾟ)'!$C39=\"\",\"\",K4+'高天井用LED器具(ｱｰﾑﾀｲﾌﾟ)'!$C39/10000)","v":0},{"$f":"IF('高天井用LED器具(ｱｰﾑﾀｲﾌﾟ)'!$C39=\"\",\"\",L4+'高天井用LED器具(ｱｰﾑﾀｲﾌﾟ)'!$C39/10000)","v":0},{"$f":"IF('高天井用LED器具(ｱｰﾑﾀｲﾌﾟ)'!$C39=\"\",\"\",M4+'高天井用LED器具(ｱｰﾑﾀｲﾌﾟ)'!$C39/10000)","v":0},{"$f":"IF('高天井用LED器具(ｱｰﾑﾀｲﾌﾟ)'!$C39=\"\",\"\",N4+'高天井用LED器具(ｱｰﾑﾀｲﾌﾟ)'!$C39/10000)","v":0},{"$f":"IF('高天井用LED器具(ｱｰﾑﾀｲﾌﾟ)'!$C39=\"\",\"\",O4+'高天井用LED器具(ｱｰﾑﾀｲﾌﾟ)'!$C39/10000)","v":0},{"$f":"IF('高天井用LED器具(ｱｰﾑﾀｲﾌﾟ)'!$C39=\"\",\"\",P4+'高天井用LED器具(ｱｰﾑﾀｲﾌﾟ)'!$C39/10000)","v":0}]
["LED",{"$f":"IF('高天井用LED器具(ｱｰﾑﾀｲﾌﾟ)'!I41=\"\",\"\",'高天井用LED器具(ｱｰﾑﾀｲﾌﾟ)'!I41/10000)","v":0},{"$f":"IF('高天井用LED器具(ｱｰﾑﾀｲﾌﾟ)'!$I39=\"\",\"\",B5+'高天井用LED器具(ｱｰﾑﾀｲﾌﾟ)'!$I39/10000)","v":0},{"$f":"IF('高天井用LED器具(ｱｰﾑﾀｲﾌﾟ)'!$I39=\"\",\"\",C5+'高天井用LED器具(ｱｰﾑﾀｲﾌﾟ)'!$I39/10000)","v":0},{"$f":"IF('高天井用LED器具(ｱｰﾑﾀｲﾌﾟ)'!$I39=\"\",\"\",D5+'高天井用LED器具(ｱｰﾑﾀｲﾌﾟ)'!$I39/10000)","v":0},{"$f":"IF('高天井用LED器具(ｱｰﾑﾀｲﾌﾟ)'!$I39=\"\",\"\",E5+'高天井用LED器具(ｱｰﾑﾀｲﾌﾟ)'!$I39/10000)","v":0},{"$f":"IF('高天井用LED器具(ｱｰﾑﾀｲﾌﾟ)'!$I39=\"\",\"\",F5+'高天井用LED器具(ｱｰﾑﾀｲﾌﾟ)'!$I39/10000)","v":0},{"$f":"IF('高天井用LED器具(ｱｰﾑﾀｲﾌﾟ)'!$I39=\"\",\"\",G5+'高天井用LED器具(ｱｰﾑﾀｲﾌﾟ)'!$I39/10000)","v":0},{"$f":"IF('高天井用LED器具(ｱｰﾑﾀｲﾌﾟ)'!$I39=\"\",\"\",H5+'高天井用LED器具(ｱｰﾑﾀｲﾌﾟ)'!$I39/10000)","v":0},{"$f":"IF('高天井用LED器具(ｱｰﾑﾀｲﾌﾟ)'!$I39=\"\",\"\",I5+'高天井用LED器具(ｱｰﾑﾀｲﾌﾟ)'!$I39/10000)","v":0},{"$f":"IF('高天井用LED器具(ｱｰﾑﾀｲﾌﾟ)'!$I39=\"\",\"\",J5+'高天井用LED器具(ｱｰﾑﾀｲﾌﾟ)'!$I39/10000)","v":0},{"$f":"IF('高天井用LED器具(ｱｰﾑﾀｲﾌﾟ)'!$I39=\"\",\"\",K5+'高天井用LED器具(ｱｰﾑﾀｲﾌﾟ)'!$I39/10000)","v":0},{"$f":"IF('高天井用LED器具(ｱｰﾑﾀｲﾌﾟ)'!$I39=\"\",\"\",L5+'高天井用LED器具(ｱｰﾑﾀｲﾌﾟ)'!$I39/10000)","v":0},{"$f":"IF('高天井用LED器具(ｱｰﾑﾀｲﾌﾟ)'!$I39=\"\",\"\",M5+'高天井用LED器具(ｱｰﾑﾀｲﾌﾟ)'!$I39/10000)","v":0},{"$f":"IF('高天井用LED器具(ｱｰﾑﾀｲﾌﾟ)'!$I39=\"\",\"\",N5+'高天井用LED器具(ｱｰﾑﾀｲﾌﾟ)'!$I39/10000)","v":0},{"$f":"IF('高天井用LED器具(ｱｰﾑﾀｲﾌﾟ)'!$I39=\"\",\"\",O5+'高天井用LED器具(ｱｰﾑﾀｲﾌﾟ)'!$I39/10000)","v":0},{"$f":"IF('高天井用LED器具(ｱｰﾑﾀｲﾌﾟ)'!$I39=\"\",\"\",P5+'高天井用LED器具(ｱｰﾑﾀｲﾌﾟ)'!$I39/10000)","v":0}]