{"text_format":"1","workbook":"xlsx","n_sheets":3,"sheets":["一体形LED","DATA","ｸﾞﾗﾌ"],"not_rendered":{"charts":1,"images":27,"macros":1,"external_links":0,"defined_names":36,"comments":0,"pivot_tables":0},"unopened":[],"bounds":{"document_bytes":16777216,"sheet_cells":100000,"rows_first":2000,"rows_last":500,"rows_between":2000,"halvings":0,"cell_chars":16384,"cell_head_chars":4096},"cells_cut":0,"cells_raw":0,"read":"whole","date_system":"1900"}

{"sheet":"一体形LED","index":0,"n_rows":74,"n_cols":256,"rows_kept":74,"cut":false,"hidden":false,"merged":[[38,0,38,1],[38,6,38,7],[36,0,36,1],[36,6,36,7],[34,0,34,1],[34,6,34,7],[0,0,0,11],[9,6,9,7],[9,0,9,1],[2,0,2,5],[2,6,2,11],[1,0,1,11],[9,8,9,11],[7,0,8,1],[7,2,8,5],[4,1,5,4],[7,6,8,7],[7,8,8,11],[16,0,16,1],[15,0,15,1],[14,0,14,1],[9,2,9,5],[14,6,14,7],[10,8,10,9],[10,10,10,11],[10,6,13,7],[10,0,13,1],[10,2,13,5],[30,0,30,1],[30,6,30,7],[32,6,32,7],[17,6,17,7],[26,6,26,7],[32,0,32,1],[24,0,24,1],[18,0,21,1],[28,0,28,1],[26,0,26,1],[17,0,17,1],[18,6,21,7],[52,2,52,3],[45,2,45,3],[36,4,36,5],[15,6,15,7],[24,6,24,7],[28,6,28,7],[53,5,55,5],[16,10,16,11],[38,4,38,5],[16,6,16,7],[39,8,39,9]]}
["省エネ計算ツール【一体形ＬＥＤベース器具 スクエアタイプ】"]
["従来の蛍光灯器具と一体形ＬＥＤベース器具の省エネ試算ができます。目安としてご活用ください。"]
["従来の蛍光灯器具",null,null,null,null,null,"一体形ＬＥＤベース器具"]
["■従来の蛍光灯器具を選んでください。↓（枠内から選択）",null,null,null,null,null,"■おすすめの一体形ＬＥＤベース器具スクエアタイプです。"]
[null,"▼",null,null,null,"※1","特長","●蛍光灯スクエア器具とほぼ同等の明るさ ※10"]
[null,null,null,null,null,null,null,"●固有エネルギー消費効率141.4～151.0 lm/W ※11"]
[null,null,null,null,null,null,null,"●端部まできれいに光る新ＬＥＤ光源ユニット採用"]
["品　　名",null,{"$f":"IF((VLOOKUP(品名,DATA!$A$4:$AD$17,1,0))=\"▼\",\"\",VLOOKUP(品名,DATA!$A$4:$AD$17,1,0))","v":""},null,null,null,"品　　名",null,{"$f":"IF((VLOOKUP(品名,DATA!$A$4:$AD$17,18,0))=\"\",\"\",VLOOKUP(品名,DATA!$A$4:$AD$17,18,0))","v":""}]
[]
["形　　式",null,{"$f":"IF(VLOOKUP(品名,DATA!$A$4:$AD$17,2,0)=\"\",\"\",(VLOOKUP(品名,DATA!$A$4:$AD$17,2,0)))","v":""},null,null,null,"形　　式",null,{"$f":"IF(VLOOKUP(品名,DATA!$A$4:$AD$17,19,0)=\"\",\"\",VLOOKUP(品名,DATA!$A$4:$AD$17,19,0))","v":""}]
["価　格\n（税抜）",null,"-",null,null,null,"価　格\n（税抜）",null,"<積算見積価格>※2",null,"<購入価格で試算>※3"]
[null,null,null,null,null,null,null,null,null,null,{"$f":"IF(OR($F$11=\"\",I12=\"\"),\"\",I12*$L$11)","v":""}]
[null,null,null,null,null,null,null,null,{"$f":"IF((VLOOKUP(品名,DATA!$A$4:$AD$17,22,0))=\"\",0,VLOOKUP(品名,DATA!$A$4:$AD$17,22,0))","v":0}," 円",0," 円"]
[]
["全光束 ※4",null,{"$f":"IF((VLOOKUP(品名,DATA!$A$4:$AD$17,11,0))=\"\",\"\",VLOOKUP(品名,DATA!$A$4:$AD$17,11,0))","v":""}," lm",null,null,"定格光束 ※5",null,{"$f":"IF((VLOOKUP(品名,DATA!$A$4:$AD$17,28,0))=\"\",\"\",VLOOKUP(品名,DATA!$A$4:$AD$17,28,0))","v":""}," lm"]
["定格消費電力 ※6",null,{"$f":"IF((VLOOKUP(品名,DATA!$A$4:$AD$17,8,0))=\"\",\"\",VLOOKUP(品名,DATA!$A$4:$AD$17,8,0))","v":""}," W",{"$f":"IF((VLOOKUP(品名,DATA!$A$4:$AD$17,13,0))=0,\"\",VLOOKUP(品名,DATA!$A$4:$AD$17,13,0))","v":""},{"$f":"IF((VLOOKUP(品名,DATA!$A$4:$AD$17,9,0))=\"\",\"\",VLOOKUP(品名,DATA!$A$4:$AD$17,9,0))","v":""},"定格消費電力 ※6",null,{"$f":"IF((VLOOKUP(品名,DATA!$A$4:$AD$17,25,0))=\"\",\"\",VLOOKUP(品名,DATA!$A$4:$AD$17,25,0))","v":""}," W",{"$f":"IF((VLOOKUP(品名,DATA!$A$4:$AD$17,30,0))=\"\",\"\",VLOOKUP(品名,DATA!$A$4:$AD$17,30,0))","v":""},{"$f":"IF((VLOOKUP(品名,DATA!$A$4:$AD$17,26,0))=\"\",\"\",VLOOKUP(品名,DATA!$A$4:$AD$17,26,0))","v":""}]
["消費効率",null,{"$f":"IF(C15=\"\",\"\",ROUND(C15/C16,1))","v":""}," lm/W",null,null,"消費効率",null,{"$f":"IF(I15=\"\",\"\",ROUND(I15/I16,1))","v":""}," lm/W","固有エネルギー消費効率"]
["ランプ寿命",null,{"$f":"IF((VLOOKUP(品名,DATA!$A$4:$AD$17,10,0))=\"\",\"\",VLOOKUP(品名,DATA!$A$4:$AD$17,10,0))","v":""}," 時間",null,null,"LED光源寿命 ※7",null,{"$f":"IF((VLOOKUP(品名,DATA!$A$4:$AD$17,27,0))=\"\",\"\",VLOOKUP(品名,DATA!$A$4:$AD$17,27,0))","v":""}," 時間"]
["外観",null,null,null,null,null,"外観"]
[]
[]
[]
["■試算条件を入力ください。（枠内に入力ください）",null,null,null,null,null,"■試算条件を入力ください。（枠内に入力ください）"]
[]
["　使用台数",null,1," 台",null,null,"　使用台数",null,1," 台"]
[]
["　電力料金 ※8",null,28," 円/kWh","＊任意に変更ができます。",null,"　電力料金 ※8",null,{"$f":"C27","v":28}," 円/kWh"]
[]
["　1日の点灯時間",null,10," 時間/日",null,null,"　1日の点灯時間",null,{"$f":"C29","v":10}," 時間/日"]
[]
["　年間使用日数",null,300," 日/年  ※9",null,null,"　年間使用日数",null,{"$f":"C31","v":300}," 日/年"]
[]
["　年間点灯時間",null,{"$f":"C29*C31","v":3000}," 時間/年",null,null,"　年間点灯時間",null,{"$f":"I29*I31","v":3000}," 時間/年"]
[]
["　年間消費電力",null,{"$f":"IF(C16=\"\",0,IF(F16=\"\",C16*C25*C33/1000,F16*C25*C33/1000))","v":0}," kWh/年",null,null,"　年間消費電力",null,{"$f":"IF(I16=\"\",0,IF(L16=\"\",I16*I25*I33/1000,L16*I25*I33/1000))","v":0}," kWh/年"]
[]
["　ランニングコスト",null,{"$f":"$C$35*$C$27","v":0}," 円/年",null,null,"　ランニングコスト",null,{"$f":"$I$35*$I$27","v":0}," 円/年",{"$f":"IF(OR(C37=0,I37=0),\"-\",IF(((I37-C37)/C37)<0,ROUNDDOWN((I37-C37)/C37,2),ROUNDUP((I37-C37)/C37,2)))","v":"-"},{"$f":"IF(OR(K37=\"-\",K37=0),\"\",IF(K37<0,\"低減\",\"アップ\"))","v":""}]
[]
["　(年間電力費）",null,null,null,{"$f":"IF(C14=0,\"\",IF(J42>0,\"●設備費用なしの試算です！\",IF(E14=0,\"●積算見積価格の試算です！\",\"●購入価格の試算です！\")))","v":""},null,"　イニシャルコスト",null,{"$f":"IF(I13=0,0,IF(K13=0,I13*I25,K13*I25))","v":0}," 円",null,{"$f":"IF(OR(K39=\"-\",K39=0),\"\",IF(K39<0,\"低減\",\"アップ\"))","v":""}]
[null,null,null,null,null,null,null,null,{"$f":"IF(I13=0,\"\",IF(K13=0,\"●積算見積価格の試算です！\",\"●購入価格の試算です！\"))","v":""}]
[null,null,null,null,null,null,null,null,null,null,null,null,null,"■従来の設備費用を除く試算の場合は、保守ランプ価格（１台当りの価格）を入力ください。※11","■従来の設備費用を除く試算の場合は、保守ランプ価格（１台当りの価格）を入力ください。※11","■従来の設備費用を除く試算の場合は、保守ランプ価格（１台当りの価格）を入力ください。※11","■従来の設備費用を除く試算の場合は、保守ランプ価格（１台当りの価格）を入力ください。※11","■従来の設備費用を除く試算の場合は、保守ランプ価格（１台当りの価格）を入力ください。※11","■従来の設備費用を除く試算の場合は、保守ランプ価格（１台当りの価格）を入力ください。※11","■従来の設備費用を除く試算の場合は、保守ランプ価格（１台当りの価格）を入力ください。※11","■従来の設備費用を除く試算の場合は、保守ランプ価格（１台当りの価格）を入力ください。※11","■従来の設備費用を除く試算の場合は、保守ランプ価格（１台当りの価格）を入力ください。※11","■従来の設備費用を除く試算の場合は、保守ランプ価格（１台当りの価格）を入力ください。※11","■従来の設備費用を除く試算の場合は、保守ランプ価格（１台当りの価格）を入力ください。※11","■従来の設備費用を除く試算の場合は、保守ランプ価格（１台当りの価格）を入力ください。※11","■従来の設備費用を除く試算の場合は、保守ランプ価格（１台当りの価格）を入力ください。※11","■従来の設備費用を除く試算の場合は、保守ランプ価格（１台当りの価格）を入力ください。※11","■従来の設備費用を除く試算の場合は、保守ランプ価格（１台当りの価格）を入力ください。※11","■従来の設備費用を除く試算の場合は、保守ランプ価格（１台当りの価格）を入力ください。※11","■従来の設備費用を除く試算の場合は、保守ランプ価格（１台当りの価格）を入力ください。※11","■従来の設備費用を除く試算の場合は、保守ランプ価格（１台当りの価格）を入力ください。※11","■従来の設備費用を除く試算の場合は、保守ランプ価格（１台当りの価格）を入力ください。※11","■従来の設備費用を除く試算の場合は、保守ランプ価格（１台当りの価格）を入力ください。※11","■従来の設備費用を除く試算の場合は、保守ランプ価格（１台当りの価格）を入力ください。※11","■従来の設備費用を除く試算の場合は、保守ランプ価格（１台当りの価格）を入力ください。※11","■従来の設備費用を除く試算の場合は、保守ランプ価格（１台当りの価格）を入力ください。※11","■従来の設備費用を除く試算の場合は、保守ランプ価格（１台当りの価格）を入力ください。※11","■従来の設備費用を除く試算の場合は、保守ランプ価格（１台当りの価格）を入力ください。※11","■従来の設備費用を除く試算の場合は、保守ランプ価格（１台当りの価格）を入力ください。※11","■従来の設備費用を除く試算の場合は、保守ランプ価格（１台当りの価格）を入力ください。※11","■従来の設備費用を除く試算の場合は、保守ランプ価格（１台当りの価格）を入力ください。※11","■従来の設備費用を除く試算の場合は、保守ランプ価格（１台当りの価格）を入力ください。※11","■従来の設備費用を除く試算の場合は、保守ランプ価格（１台当りの価格）を入力ください。※11","■従来の設備費用を除く試算の場合は、保守ランプ価格（１台当りの価格）を入力ください。※11","■従来の設備費用を除く試算の場合は、保守ランプ価格（１台当りの価格）を入力ください。※11","■従来の設備費用を除く試算の場合は、保守ランプ価格（１台当りの価格）を入力ください。※11","■従来の設備費用を除く試算の場合は、保守ランプ価格（１台当りの価格）を入力ください。※11","■従来の設備費用を除く試算の場合は、保守ランプ価格（１台当りの価格）を入力ください。※11","■従来の設備費用を除く試算の場合は、保守ランプ価格（１台当りの価格）を入力ください。※11","■従来の設備費用を除く試算の場合は、保守ランプ価格（１台当りの価格）を入力ください。※11","■従来の設備費用を除く試算の場合は、保守ランプ価格（１台当りの価格）を入力ください。※11","■従来の設備費用を除く試算の場合は、保守ランプ価格（１台当りの価格）を入力ください。※11","■従来の設備費用を除く試算の場合は、保守ランプ価格（１台当りの価格）を入力ください。※11","■従来の設備費用を除く試算の場合は、保守ランプ価格（１台当りの価格）を入力ください。※11","■従来の設備費用を除く試算の場合は、保守ランプ価格（１台当りの価格）を入力ください。※11","■従来の設備費用を除く試算の場合は、保守ランプ価格（１台当りの価格）を入力ください。※11","■従来の設備費用を除く試算の場合は、保守ランプ価格（１台当りの価格）を入力ください。※11","■従来の設備費用を除く試算の場合は、保守ランプ価格（１台当りの価格）を入力ください。※11","■従来の設備費用を除く試算の場合は、保守ランプ価格（１台当りの価格）を入力ください。※11","■従来の設備費用を除く試算の場合は、保守ランプ価格（１台当りの価格）を入力ください。※11","■従来の設備費用を除く試算の場合は、保守ランプ価格（１台当りの価格）を入力ください。※11","■従来の設備費用を除く試算の場合は、保守ランプ価格（１台当りの価格）を入力ください。※11","■従来の設備費用を除く試算の場合は、保守ランプ価格（１台当りの価格）を入力ください。※11","■従来の設備費用を除く試算の場合は、保守ランプ価格（１台当りの価格）を入力ください。※11","■従来の設備費用を除く試算の場合は、保守ランプ価格（１台当りの価格）を入力ください。※11","■従来の設備費用を除く試算の場合は、保守ランプ価格（１台当りの価格）を入力ください。※11","■従来の設備費用を除く試算の場合は、保守ランプ価格（１台当りの価格）を入力ください。※11","■従来の設備費用を除く試算の場合は、保守ランプ価格（１台当りの価格）を入力ください。※11","■従来の設備費用を除く試算の場合は、保守ランプ価格（１台当りの価格）を入力ください。※11","■従来の設備費用を除く試算の場合は、保守ランプ価格（１台当りの価格）を入力ください。※11","■従来の設備費用を除く試算の場合は、保守ランプ価格（１台当りの価格）を入力ください。※11","■従来の設備費用を除く試算の場合は、保守ランプ価格（１台当りの価格）を入力ください。※11","■従来の設備費用を除く試算の場合は、保守ランプ価格（１台当りの価格）を入力ください。※11","■従来の設備費用を除く試算の場合は、保守ランプ価格（１台当りの価格）を入力ください。※11","■従来の設備費用を除く試算の場合は、保守ランプ価格（１台当りの価格）を入力ください。※11","■従来の設備費用を除く試算の場合は、保守ランプ価格（１台当りの価格）を入力ください。※11","■従来の設備費用を除く試算の場合は、保守ランプ価格（１台当りの価格）を入力ください。※11","■従来の設備費用を除く試算の場合は、保守ランプ価格（１台当りの価格）を入力ください。※11","■従来の設備費用を除く試算の場合は、保守ランプ価格（１台当りの価格）を入力ください。※11","■従来の設備費用を除く試算の場合は、保守ランプ価格（１台当りの価格）を入力ください。※11","■従来の設備費用を除く試算の場合は、保守ランプ価格（１台当りの価格）を入力ください。※11","■従来の設備費用を除く試算の場合は、保守ランプ価格（１台当りの価格）を入力ください。※11","■従来の設備費用を除く試算の場合は、保守ランプ価格（１台当りの価格）を入力ください。※11","■従来の設備費用を除く試算の場合は、保守ランプ価格（１台当りの価格）を入力ください。※11","■従来の設備費用を除く試算の場合は、保守ランプ価格（１台当りの価格）を入力ください。※11","■従来の設備費用を除く試算の場合は、保守ランプ価格（１台当りの価格）を入力ください。※11","■従来の設備費用を除く試算の場合は、保守ランプ価格（１台当りの価格）を入力ください。※11","■従来の設備費用を除く試算の場合は、保守ランプ価格（１台当りの価格）を入力ください。※11","■従来の設備費用を除く試算の場合は、保守ランプ価格（１台当りの価格）を入力ください。※11","■従来の設備費用を除く試算の場合は、保守ランプ価格（１台当りの価格）を入力ください。※11","■従来の設備費用を除く試算の場合は、保守ランプ価格（１台当りの価格）を入力ください。※11","■従来の設備費用を除く試算の場合は、保守ランプ価格（１台当りの価格）を入力ください。※11","■従来の設備費用を除く試算の場合は、保守ランプ価格（１台当りの価格）を入力ください。※11","■従来の設備費用を除く試算の場合は、保守ランプ価格（１台当りの価格）を入力ください。※11","■従来の設備費用を除く試算の場合は、保守ランプ価格（１台当りの価格）を入力ください。※11","■従来の設備費用を除く試算の場合は、保守ランプ価格（１台当りの価格）を入力ください。※11","■従来の設備費用を除く試算の場合は、保守ランプ価格（１台当りの価格）を入力ください。※11","■従来の設備費用を除く試算の場合は、保守ランプ価格（１台当りの価格）を入力ください。※11","■従来の設備費用を除く試算の場合は、保守ランプ価格（１台当りの価格）を入力ください。※11","■従来の設備費用を除く試算の場合は、保守ランプ価格（１台当りの価格）を入力ください。※11","■従来の設備費用を除く試算の場合は、保守ランプ価格（１台当りの価格）を入力ください。※11","■従来の設備費用を除く試算の場合は、保守ランプ価格（１台当りの価格）を入力ください。※11","■従来の設備費用を除く試算の場合は、保守ランプ価格（１台当りの価格）を入力ください。※11","■従来の設備費用を除く試算の場合は、保守ランプ価格（１台当りの価格）を入力ください。※11","■従来の設備費用を除く試算の場合は、保守ランプ価格（１台当りの価格）を入力ください。※11","■従来の設備費用を除く試算の場合は、保守ランプ価格（１台当りの価格）を入力ください。※11","■従来の設備費用を除く試算の場合は、保守ランプ価格（１台当りの価格）を入力ください。※11","■従来の設備費用を除く試算の場合は、保守ランプ価格（１台当りの価格）を入力ください。※11","■従来の設備費用を除く試算の場合は、保守ランプ価格（１台当りの価格）を入力ください。※11","■従来の設備費用を除く試算の場合は、保守ランプ価格（１台当りの価格）を入力ください。※11","■従来の設備費用を除く試算の場合は、保守ランプ価格（１台当りの価格）を入力ください。※11","■従来の設備費用を除く試算の場合は、保守ランプ価格（１台当りの価格）を入力ください。※11","■従来の設備費用を除く試算の場合は、保守ランプ価格（１台当りの価格）を入力ください。※11","■従来の設備費用を除く試算の場合は、保守ランプ価格（１台当りの価格）を入力ください。※11","■従来の設備費用を除く試算の場合は、保守ランプ価格（１台当りの価格）を入力ください。※11","■従来の設備費用を除く試算の場合は、保守ランプ価格（１台当りの価格）を入力ください。※11","■従来の設備費用を除く試算の場合は、保守ランプ価格（１台当りの価格）を入力ください。※11","■従来の設備費用を除く試算の場合は、保守ランプ価格（１台当りの価格）を入力ください。※11","■従来の設備費用を除く試算の場合は、保守ランプ価格（１台当りの価格）を入力ください。※11","■従来の設備費用を除く試算の場合は、保守ランプ価格（１台当りの価格）を入力ください。※11","■従来の設備費用を除く試算の場合は、保守ランプ価格（１台当りの価格）を入力ください。※11","■従来の設備費用を除く試算の場合は、保守ランプ価格（１台当りの価格）を入力ください。※11","■従来の設備費用を除く試算の場合は、保守ランプ価格（１台当りの価格）を入力ください。※11","■従来の設備費用を除く試算の場合は、保守ランプ価格（１台当りの価格）を入力ください。※11","■従来の設備費用を除く試算の場合は、保守ランプ価格（１台当りの価格）を入力ください。※11","■従来の設備費用を除く試算の場合は、保守ランプ価格（１台当りの価格）を入力ください。※11","■従来の設備費用を除く試算の場合は、保守ランプ価格（１台当りの価格）を入力ください。※11","■従来の設備費用を除く試算の場合は、保守ランプ価格（１台当りの価格）を入力ください。※11","■従来の設備費用を除く試算の場合は、保守ランプ価格（１台当りの価格）を入力ください。※11","■従来の設備費用を除く試算の場合は、保守ランプ価格（１台当りの価格）を入力ください。※11","■従来の設備費用を除く試算の場合は、保守ランプ価格（１台当りの価格）を入力ください。※11","■従来の設備費用を除く試算の場合は、保守ランプ価格（１台当りの価格）を入力ください。※11","■従来の設備費用を除く試算の場合は、保守ランプ価格（１台当りの価格）を入力ください。※11","■従来の設備費用を除く試算の場合は、保守ランプ価格（１台当りの価格）を入力ください。※11","■従来の設備費用を除く試算の場合は、保守ランプ価格（１台当りの価格）を入力ください。※11","■従来の設備費用を除く試算の場合は、保守ランプ価格（１台当りの価格）を入力ください。※11","■従来の設備費用を除く試算の場合は、保守ランプ価格（１台当りの価格）を入力ください。※11","■従来の設備費用を除く試算の場合は、保守ランプ価格（１台当りの価格）を入力ください。※11","■従来の設備費用を除く試算の場合は、保守ランプ価格（１台当りの価格）を入力ください。※11","■従来の設備費用を除く試算の場合は、保守ランプ価格（１台当りの価格）を入力ください。※11","■従来の設備費用を除く試算の場合は、保守ランプ価格（１台当りの価格）を入力ください。※11","■従来の設備費用を除く試算の場合は、保守ランプ価格（１台当りの価格）を入力ください。※11","■従来の設備費用を除く試算の場合は、保守ランプ価格（１台当りの価格）を入力ください。※11","■従来の設備費用を除く試算の場合は、保守ランプ価格（１台当りの価格）を入力ください。※11","■従来の設備費用を除く試算の場合は、保守ランプ価格（１台当りの価格）を入力ください。※11","■従来の設備費用を除く試算の場合は、保守ランプ価格（１台当りの価格）を入力ください。※11","■従来の設備費用を除く試算の場合は、保守ランプ価格（１台当りの価格）を入力ください。※11","■従来の設備費用を除く試算の場合は、保守ランプ価格（１台当りの価格）を入力ください。※11","■従来の設備費用を除く試算の場合は、保守ランプ価格（１台当りの価格）を入力ください。※11","■従来の設備費用を除く試算の場合は、保守ランプ価格（１台当りの価格）を入力ください。※11","■従来の設備費用を除く試算の場合は、保守ランプ価格（１台当りの価格）を入力ください。※11","■従来の設備費用を除く試算の場合は、保守ランプ価格（１台当りの価格）を入力ください。※11","■従来の設備費用を除く試算の場合は、保守ランプ価格（１台当りの価格）を入力ください。※11","■従来の設備費用を除く試算の場合は、保守ランプ価格（１台当りの価格）を入力ください。※11","■従来の設備費用を除く試算の場合は、保守ランプ価格（１台当りの価格）を入力ください。※11","■従来の設備費用を除く試算の場合は、保守ランプ価格（１台当りの価格）を入力ください。※11","■従来の設備費用を除く試算の場合は、保守ランプ価格（１台当りの価格）を入力ください。※11","■従来の設備費用を除く試算の場合は、保守ランプ価格（１台当りの価格）を入力ください。※11","■従来の設備費用を除く試算の場合は、保守ランプ価格（１台当りの価格）を入力ください。※11","■従来の設備費用を除く試算の場合は、保守ランプ価格（１台当りの価格）を入力ください。※11","■従来の設備費用を除く試算の場合は、保守ランプ価格（１台当りの価格）を入力ください。※11","■従来の設備費用を除く試算の場合は、保守ランプ価格（１台当りの価格）を入力ください。※11","■従来の設備費用を除く試算の場合は、保守ランプ価格（１台当りの価格）を入力ください。※11","■従来の設備費用を除く試算の場合は、保守ランプ価格（１台当りの価格）を入力ください。※11","■従来の設備費用を除く試算の場合は、保守ランプ価格（１台当りの価格）を入力ください。※11","■従来の設備費用を除く試算の場合は、保守ランプ価格（１台当りの価格）を入力ください。※11","■従来の設備費用を除く試算の場合は、保守ランプ価格（１台当りの価格）を入力ください。※11","■従来の設備費用を除く試算の場合は、保守ランプ価格（１台当りの価格）を入力ください。※11","■従来の設備費用を除く試算の場合は、保守ランプ価格（１台当りの価格）を入力ください。※11","■従来の設備費用を除く試算の場合は、保守ランプ価格（１台当りの価格）を入力ください。※11","■従来の設備費用を除く試算の場合は、保守ランプ価格（１台当りの価格）を入力ください。※11","■従来の設備費用を除く試算の場合は、保守ランプ価格（１台当りの価格）を入力ください。※11","■従来の設備費用を除く試算の場合は、保守ランプ価格（１台当りの価格）を入力ください。※11","■従来の設備費用を除く試算の場合は、保守ランプ価格（１台当りの価格）を入力ください。※11","■従来の設備費用を除く試算の場合は、保守ランプ価格（１台当りの価格）を入力ください。※11","■従来の設備費用を除く試算の場合は、保守ランプ価格（１台当りの価格）を入力ください。※11","■従来の設備費用を除く試算の場合は、保守ランプ価格（１台当りの価格）を入力ください。※11","■従来の設備費用を除く試算の場合は、保守ランプ価格（１台当りの価格）を入力ください。※11","■従来の設備費用を除く試算の場合は、保守ランプ価格（１台当りの価格）を入力ください。※11","■従来の設備費用を除く試算の場合は、保守ランプ価格（１台当りの価格）を入力ください。※11","■従来の設備費用を除く試算の場合は、保守ランプ価格（１台当りの価格）を入力ください。※11","■従来の設備費用を除く試算の場合は、保守ランプ価格（１台当りの価格）を入力ください。※11","■従来の設備費用を除く試算の場合は、保守ランプ価格（１台当りの価格）を入力ください。※11","■従来の設備費用を除く試算の場合は、保守ランプ価格（１台当りの価格）を入力ください。※11","■従来の設備費用を除く試算の場合は、保守ランプ価格（１台当りの価格）を入力ください。※11","■従来の設備費用を除く試算の場合は、保守ランプ価格（１台当りの価格）を入力ください。※11","■従来の設備費用を除く試算の場合は、保守ランプ価格（１台当りの価格）を入力ください。※11","■従来の設備費用を除く試算の場合は、保守ランプ価格（１台当りの価格）を入力ください。※11","■従来の設備費用を除く試算の場合は、保守ランプ価格（１台当りの価格）を入力ください。※11","■従来の設備費用を除く試算の場合は、保守ランプ価格（１台当りの価格）を入力ください。※11","■従来の設備費用を除く試算の場合は、保守ランプ価格（１台当りの価格）を入力ください。※11","■従来の設備費用を除く試算の場合は、保守ランプ価格（１台当りの価格）を入力ください。※11","■従来の設備費用を除く試算の場合は、保守ランプ価格（１台当りの価格）を入力ください。※11","■従来の設備費用を除く試算の場合は、保守ランプ価格（１台当りの価格）を入力ください。※11","■従来の設備費用を除く試算の場合は、保守ランプ価格（１台当りの価格）を入力ください。※11","■従来の設備費用を除く試算の場合は、保守ランプ価格（１台当りの価格）を入力ください。※11","■従来の設備費用を除く試算の場合は、保守ランプ価格（１台当りの価格）を入力ください。※11","■従来の設備費用を除く試算の場合は、保守ランプ価格（１台当りの価格）を入力ください。※11","■従来の設備費用を除く試算の場合は、保守ランプ価格（１台当りの価格）を入力ください。※11","■従来の設備費用を除く試算の場合は、保守ランプ価格（１台当りの価格）を入力ください。※11","■従来の設備費用を除く試算の場合は、保守ランプ価格（１台当りの価格）を入力ください。※11","■従来の設備費用を除く試算の場合は、保守ランプ価格（１台当りの価格）を入力ください。※11","■従来の設備費用を除く試算の場合は、保守ランプ価格（１台当りの価格）を入力ください。※11","■従来の設備費用を除く試算の場合は、保守ランプ価格（１台当りの価格）を入力ください。※11","■従来の設備費用を除く試算の場合は、保守ランプ価格（１台当りの価格）を入力ください。※11","■従来の設備費用を除く試算の場合は、保守ランプ価格（１台当りの価格）を入力ください。※11","■従来の設備費用を除く試算の場合は、保守ランプ価格（１台当りの価格）を入力ください。※11","■従来の設備費用を除く試算の場合は、保守ランプ価格（１台当りの価格）を入力ください。※11","■従来の設備費用を除く試算の場合は、保守ランプ価格（１台当りの価格）を入力ください。※11","■従来の設備費用を除く試算の場合は、保守ランプ価格（１台当りの価格）を入力ください。※11","■従来の設備費用を除く試算の場合は、保守ランプ価格（１台当りの価格）を入力ください。※11","■従来の設備費用を除く試算の場合は、保守ランプ価格（１台当りの価格）を入力ください。※11","■従来の設備費用を除く試算の場合は、保守ランプ価格（１台当りの価格）を入力ください。※11","■従来の設備費用を除く試算の場合は、保守ランプ価格（１台当りの価格）を入力ください。※11","■従来の設備費用を除く試算の場合は、保守ランプ価格（１台当りの価格）を入力ください。※11","■従来の設備費用を除く試算の場合は、保守ランプ価格（１台当りの価格）を入力ください。※11","■従来の設備費用を除く試算の場合は、保守ランプ価格（１台当りの価格）を入力ください。※11","■従来の設備費用を除く試算の場合は、保守ランプ価格（１台当りの価格）を入力ください。※11","■従来の設備費用を除く試算の場合は、保守ランプ価格（１台当りの価格）を入力ください。※11","■従来の設備費用を除く試算の場合は、保守ランプ価格（１台当りの価格）を入力ください。※11","■従来の設備費用を除く試算の場合は、保守ランプ価格（１台当りの価格）を入力ください。※11","■従来の設備費用を除く試算の場合は、保守ランプ価格（１台当りの価格）を入力ください。※11","■従来の設備費用を除く試算の場合は、保守ランプ価格（１台当りの価格）を入力ください。※11","■従来の設備費用を除く試算の場合は、保守ランプ価格（１台当りの価格）を入力ください。※11","■従来の設備費用を除く試算の場合は、保守ランプ価格（１台当りの価格）を入力ください。※11","■従来の設備費用を除く試算の場合は、保守ランプ価格（１台当りの価格）を入力ください。※11","■従来の設備費用を除く試算の場合は、保守ランプ価格（１台当りの価格）を入力ください。※11","■従来の設備費用を除く試算の場合は、保守ランプ価格（１台当りの価格）を入力ください。※11","■従来の設備費用を除く試算の場合は、保守ランプ価格（１台当りの価格）を入力ください。※11","■従来の設備費用を除く試算の場合は、保守ランプ価格（１台当りの価格）を入力ください。※11","■従来の設備費用を除く試算の場合は、保守ランプ価格（１台当りの価格）を入力ください。※11","■従来の設備費用を除く試算の場合は、保守ランプ価格（１台当りの価格）を入力ください。※11","■従来の設備費用を除く試算の場合は、保守ランプ価格（１台当りの価格）を入力ください。※11","■従来の設備費用を除く試算の場合は、保守ランプ価格（１台当りの価格）を入力ください。※11","■従来の設備費用を除く試算の場合は、保守ランプ価格（１台当りの価格）を入力ください。※11","■従来の設備費用を除く試算の場合は、保守ランプ価格（１台当りの価格）を入力ください。※11","■従来の設備費用を除く試算の場合は、保守ランプ価格（１台当りの価格）を入力ください。※11","■従来の設備費用を除く試算の場合は、保守ランプ価格（１台当りの価格）を入力ください。※11","■従来の設備費用を除く試算の場合は、保守ランプ価格（１台当りの価格）を入力ください。※11","■従来の設備費用を除く試算の場合は、保守ランプ価格（１台当りの価格）を入力ください。※11","■従来の設備費用を除く試算の場合は、保守ランプ価格（１台当りの価格）を入力ください。※11","■従来の設備費用を除く試算の場合は、保守ランプ価格（１台当りの価格）を入力ください。※11","■従来の設備費用を除く試算の場合は、保守ランプ価格（１台当りの価格）を入力ください。※11","■従来の設備費用を除く試算の場合は、保守ランプ価格（１台当りの価格）を入力ください。※11","■従来の設備費用を除く試算の場合は、保守ランプ価格（１台当りの価格）を入力ください。※11","■従来の設備費用を除く試算の場合は、保守ランプ価格（１台当りの価格）を入力ください。※11","■従来の設備費用を除く試算の場合は、保守ランプ価格（１台当りの価格）を入力ください。※11","■従来の設備費用を除く試算の場合は、保守ランプ価格（１台当りの価格）を入力ください。※11","■従来の設備費用を除く試算の場合は、保守ランプ価格（１台当りの価格）を入力ください。※11","■従来の設備費用を除く試算の場合は、保守ランプ価格（１台当りの価格）を入力ください。※11","■従来の設備費用を除く試算の場合は、保守ランプ価格（１台当りの価格）を入力ください。※11","■従来の設備費用を除く試算の場合は、保守ランプ価格（１台当りの価格）を入力ください。※11","■従来の設備費用を除く試算の場合は、保守ランプ価格（１台当りの価格）を入力ください。※11","■従来の設備費用を除く試算の場合は、保守ランプ価格（１台当りの価格）を入力ください。※11","■従来の設備費用を除く試算の場合は、保守ランプ価格（１台当りの価格）を入力ください。※11","■従来の設備費用を除く試算の場合は、保守ランプ価格（１台当りの価格）を入力ください。※11"]
[]
[]
["■試算結果"]
["　【結果１】　ランニングコスト比較（年間電力費+年間ランプ費+年間交換作業費）"]
[null,null,"ランニングコスト",null,"比較"]
[null,"蛍光灯",{"$f":"IF(C37=\"\",0,ROUND(C37,0))","v":0}," 円/年",{"$f":"IF(C47=0,\"-\",100%)","v":"-"}]
[null,"ＬＥＤ",{"$f":"IF(I37=\"\",0,ROUND(I37,0))","v":0}," 円/年",{"$f":"IF(OR(C47=0,C48=0),\"-\",IF((C48/C47)<0,ROUNDDOWN((C48/C47),2),ROUNDUP((C48/C47),2)))","v":"-"}]
[null,"差額",{"$f":"C48-C47","v":0}," 円/年",{"$f":"IF(OR(C47=0,C49=0),\"-\",IF((C49/C47)<0,ROUNDDOWN((C49/C47),2),ROUNDUP((C49/C47),2)))","v":"-"}]
[null,{"$f":"IF(OR(C49=0,C49>0),\"\",\"●ＬＥＤなら年間 \"&TEXT(-C49,\"#,##0\")&\"円 お得です！\")","v":""}]
[]
["　【結果２】　イニシャルコスト比較（設備費用）と設備償却"]
[null,null,"イニシャルコスト",null,"比較","設備償却"]
[null,"蛍光灯",{"$f":"IF(C39=\"\",0,ROUND(C39,0))","v":0}," 円",{"$f":"IF(C54=0,\"-\",100%)","v":"-"},{"$f":"IF(OR(C37=0,I37=0,C56=0),\"-\",IF((C39-I39)/-(C37-I37)<0,\"-\",ROUNDUP((C39-I39)/-(C37-I37),1)))","v":"-"}]
[null,"ＬＥＤ",{"$f":"IF(I39=\"\",0,ROUND(I39,0))","v":0}," 円",{"$f":"IF(OR(C54=0,C55=0),\"-\",IF((C55/C54)<0,ROUNDDOWN((C55/C54),2),ROUNDUP((C55/C54),2)))","v":"-"}]
[null,"差額",{"$f":"IF(C54=\"\",0,C55-C54)","v":0}," 円",{"$f":"IF(OR(C54=0,C56=0),\"-\",IF((C56/C54)<0,ROUNDDOWN((C56/C54),2),ROUNDUP((C56/C54),2)))","v":"-"},null,"＊設備償却=イニシャルコスト差額÷ランニングコスト差額"]
["　＊イニシャルコストの償却期間は、従来の照明器具費とＬＥＤ照明器具費の差額を、ランニングコストの差額で割り試算しています。　試算条件によっては、"]
["　　「一般社団法人日本照明工業会 ガイド111」による適正交換時期や耐用の限度を超える場合がありますが、寿命を保証するものではありません。"]
[]
["※1 従来の蛍光灯器具を選択すると、おすすめのLED照明器具が表示されますが、明るさを保証するものではありません。"]
{"$rows_left_out":15}
{"sheet":"DATA","index":1,"n_rows":19,"n_cols":30,"rows_kept":19,"cut":false,"hidden":true,"merged":[[1,17,1,29],[1,0,1,15]]}
["【DATE】"]
["従来器具",null,null,null,null,null,null,null,null,null,null,null,null,null,null,null,null,"提案ＬＥＤ器具"]
["従来品名","表示形式","従来形式","従来画像","従来器具","従来ランプ","合計","定格消費電力","平均消費電力","定格寿命","全光束","消費効率","照度補正の場合","灯数","交換費@","ランプ@",null,"提案ＬＥＤ","提案表示形式","提案形式","提案画像","器具","ランプ","合計","定格消費電力","平均消費電力","定格寿命","定格光束","消費効率","照度補正の場合"]
["▼",null,"KUHAKU",null,null,null,null,null,null,null,null,null,null,null,null,null,null,null,null,"KUHAKULED"]
["FHP32W4灯 直付・埋込兼用下面開放","HNM32401A-EN14","HNM32401AEN14",null,36800,5700,{"$f":"SUM(E5:F5)","v":42500},107,null,12000,9620,{"$f":"K5/H5","v":89.90654205607477},null,4,200,1900,null,"FHP32形4灯相当 LED直付・埋込兼用下面開放\n照度補正・調光兼用形 昼白色","NE324AN-JZU14A","NE324ANJZU14A",null,65800,null,{"$f":"SUM(V5:W5)","v":65800},56.3,51,40000,8500,{"$f":"AB5/Y5","v":150.97690941385437},"平均消費電力"]
["FHP32W3灯 埋込下面開放","HTM32301-EN14","HTM32301EN14",null,27300,5700,{"$f":"SUM(E6:F6)","v":33000},83,null,12000,7370,{"$f":"K6/H6","v":88.795180722891573},null,3,200,1900,null,"FHP32形3灯相当 LED埋込下面開放\n照度補正・調光兼用形 昼白色","TE324AN-JZ14A","TE324ANJZ14A",null,55500,null,{"$f":"SUM(V6:W6)","v":55500},44.9,40.6,40000,6560,{"$f":"AB6/Y6","v":146.10244988864142},"平均消費電力"]
["FHP32W4灯 埋込下面開放","HTM32401-EN14","HTM32401EN14",null,28400,7600,36000,107,null,12000,9620,89.90654205607477,null,4,200,1900,null,"FHP32形4灯相当 LED埋込下面開放\n照度補正・調光兼用形 昼白色","TE324AN-JZU14A","TE324ANJZU14A",null,62400,null,62400,56.3,51,40000,8260,146.71403197158082,"平均消費電力"]
["FHP32W3灯 埋込ルーバ付","HTL32301-EN14","HTL32301EN14",null,32300,5700,38000,83,null,12000,7370,88.795180722891573,null,3,200,1900,null,"FHP32形3灯相当 LED埋込ルーバ付\n照度補正・調光兼用形 昼白色","TLE324AN-JZ14A","TLE324ANJZ14A",null,61200,null,61200,44.9,40.6,40000,6380,142.09354120267261,"平均消費電力"]
["FHP32W4灯 埋込ルーバ付","HTL32401-EN14","HTL32401EN14",null,33400,7600,41000,107,null,12000,9620,89.90654205607477,null,4,200,1900,null,"FHP32形4灯相当 LED埋込ルーバ付\n照度補正・調光兼用形 昼白色","TLE324AN-JZU14A","TLE324ANJZU14A",null,68100,null,68100,56.3,51,40000,8030,142.62877442273535,"平均消費電力"]
["FHP32W3灯 埋込乳白カバー付","HTP32301-EN14","HTP32301EN14",null,37300,5700,43000,83,null,12000,7370,88.795180722891573,null,3,200,1900,null,"FHP32形3灯相当 LED埋込乳白カバー付\n照度補正・調光兼用形 昼白色","TPE324AN-JZ14A","TPE324ANJZ14A",null,64700,null,64700,44.9,40.6,40000,4800,106.90423162583519,"平均消費電力"]
["FHP32W4灯 埋込乳白カバー付","HTP32401-EN14","HTP32401EN14",null,43400,7600,51000,107,null,12000,9620,89.90654205607477,null,4,200,1900,null,"FHP32形4灯相当 LED埋込乳白カバー付\n照度補正・調光兼用形 昼白色","TPE324AN-JZU14A","TPE324ANJZU14A",null,73900,null,73900,56.3,51,40000,6050,107.46003552397869,"平均消費電力"]
["FHP45W4灯 直付・埋込兼用下面開放","HNM45401A-EN14","HNM45401AEN14",null,54800,9200,64000,172,null,12000,15900,92.441860465116278,null,4,200,2300,null,"FHP45形4灯相当 LED直付・埋込兼用下面開放\n照度補正・調光兼用形 昼白色","NE454AN-JZU14A","NE454ANJZU14A",null,78500,null,78500,87.4,79.099999999999994,40000,12620,144.39359267734554,"平均消費電力"]
["FHP45W4灯 直付・埋込兼用下面開放\n照度補正形","HNM45401A-PKN14","HNM45401APKN14",null,70800,9200,80000,172,146,12000,15900,92.441860465116278,"平均消費電力",4,200,2300,null,"FHP45形4灯相当 LED直付・埋込兼用下面開放\n照度補正・調光兼用形 昼白色","NE454AN-JZU14A","NE454ANJZU14A",null,78500,null,{"$f":"SUM(V13:W13)","v":78500},87.4,79.099999999999994,40000,12620,{"$f":"AB13/Y13","v":144.39359267734554},"平均消費電力"]
["FHP45W4灯 直付・埋込兼用ルーバ付\n照度補正形","HNL45401A-PKN14","HNL45401APKN14",null,76800,9200,86000,172,146,12000,15900,92.441860465116278,"平均消費電力",4,200,2300,null,"FHP45形4灯相当 LED直付・埋込兼用ルーバ付\n照度補正・調光兼用形 昼白色","NLE454AN-JZU14A","NLE454ANJZU14A",null,85400,null,85400,87.4,79.099999999999994,40000,12180,{"$f":"AB14/Y14","v":139.35926773455375},"平均消費電力"]
["FHP45W4灯 埋込下面開放","HTM45401-EN14","HTM45401EN14",null,52800,9200,62000,165,null,12000,14700,89.090909090909093,null,4,200,2300,null,"FHP45形4灯相当 LED埋込下面開放\n照度補正・調光兼用形 昼白色","TE454AN-JZU14A","TE454ANJZU14A",null,75100,null,75100,87.4,79.099999999999994,40000,12360,{"$f":"AB15/Y15","v":141.41876430205949},"平均消費電力"]
["FHP45W4灯 埋込ルーバ付","HTL45401-EN14","HTL45401EN14",null,56800,9200,66000,165,null,12000,14700,89.090909090909093,null,4,200,2300,null,"FHP45形4灯相当 LED埋込ルーバ付\n照度補正・調光兼用形 昼白色","TLE454AN-JZU14A","TLE454ANJZU14A",null,82000,null,82000,87.4,79.099999999999994,40000,11950,{"$f":"AB16/Y16","v":136.72768878718534},"平均消費電力"]
["FHP45W4灯 埋込乳白カバー付","HTP45401-EN14","HTP45401EN14",null,60800,9200,70000,160,null,12000,14230,88.9375,null,4,200,2300,null,"FHP45形4灯相当 LED埋込乳白カバー付\n照度補正・調光兼用形 昼白色","TPE454AN-JZU14A","TPE454ANJZU14A",null,99200,null,99200,87.4,79.099999999999994,40000,9780,{"$f":"AB17/Y17","v":111.89931350114416},"平均消費電力"]
[]
[null,null,null,null,null,null,null,null,null,null,null,null,null,null,"↑年間交換作業費は200円/本（税抜）で試算しています（一般社団法人日本照明工業会 技術資料114-1996によるFHF32と同一の交換作業費で試算）。"]

{"sheet":"ｸﾞﾗﾌ","index":2,"n_rows":5,"n_cols":17,"rows_kept":5,"cut":false,"hidden":true,"merged":[]}
[]
[]
["使用年数",0,1,2,3,4,5,6,7,8,9,10,11,12,13,14,15]
["蛍光灯",{"$f":"IF(一体形LED!C39=\"\",0,一体形LED!C39/10000)","v":0},{"$f":"IF(一体形LED!$C37=\"\",\"\",B4+一体形LED!$C37/10000)","v":0},{"$f":"IF(一体形LED!$C37=\"\",\"\",C4+一体形LED!$C37/10000)","v":0},{"$f":"IF(一体形LED!$C37=\"\",\"\",D4+一体形LED!$C37/10000)","v":0},{"$f":"IF(一体形LED!$C37=\"\",\"\",E4+一体形LED!$C37/10000)","v":0},{"$f":"IF(一体形LED!$C37=\"\",\"\",F4+一体形LED!$C37/10000)","v":0},{"$f":"IF(一体形LED!$C37=\"\",\"\",G4+一体形LED!$C37/10000)","v":0},{"$f":"IF(一体形LED!$C37=\"\",\"\",H4+一体形LED!$C37/10000)","v":0},{"$f":"IF(一体形LED!$C37=\"\",\"\",I4+一体形LED!$C37/10000)","v":0},{"$f":"IF(一体形LED!$C37=\"\",\"\",J4+一体形LED!$C37/10000)","v":0},{"$f":"IF(一体形LED!$C37=\"\",\"\",K4+一体形LED!$C37/10000)","v":0},{"$f":"IF(一体形LED!$C37=\"\",\"\",L4+一体形LED!$C37/10000)","v":0},{"$f":"IF(一体形LED!$C37=\"\",\"\",M4+一体形LED!$C37/10000)","v":0},{"$f":"IF(一体形LED!$C37=\"\",\"\",N4+一体形LED!$C37/10000)","v":0},{"$f":"IF(一体形LED!$C37=\"\",\"\",O4+一体形LED!$C37/10000)","v":0},{"$f":"IF(一体形LED!$C37=\"\",\"\",P4+一体形LED!$C37/10000)","v":0}]
["LED",{"$f":"IF(一体形LED!I39=\"\",\"\",一体形LED!I39/10000)","v":0},{"$f":"IF(一体形LED!$I37=\"\",\"\",B5+一体形LED!$I37/10000)","v":0},{"$f":"IF(一体形LED!$I37=\"\",\"\",C5+一体形LED!$I37/10000)","v":0},{"$f":"IF(一体形LED!$I37=\"\",\"\",D5+一体形LED!$I37/10000)","v":0},{"$f":"IF(一体形LED!$I37=\"\",\"\",E5+一体形LED!$I37/10000)","v":0},{"$f":"IF(一体形LED!$I37=\"\",\"\",F5+一体形LED!$I37/10000)","v":0},{"$f":"IF(一体形LED!$I37=\"\",\"\",G5+一体形LED!$I37/10000)","v":0},{"$f":"IF(一体形LED!$I37=\"\",\"\",H5+一体形LED!$I37/10000)","v":0},{"$f":"IF(一体形LED!$I37=\"\",\"\",I5+一体形LED!$I37/10000)","v":0},{"$f":"IF(一体形LED!$I37=\"\",\"\",J5+一体形LED!$I37/10000)","v":0},{"$f":"IF(一体形LED!$I37=\"\",\"\",K5+一体形LED!$I37/10000)","v":0},{"$f":"IF(一体形LED!$I37=\"\",\"\",L5+一体形LED!$I37/10000)","v":0},{"$f":"IF(一体形LED!$I37=\"\",\"\",M5+一体形LED!$I37/10000)","v":0},{"$f":"IF(一体形LED!$I37=\"\",\"\",N5+一体形LED!$I37/10000)","v":0},{"$f":"IF(一体形LED!$I37=\"\",\"\",O5+一体形LED!$I37/10000)","v":0},{"$f":"IF(一体形LED!$I37=\"\",\"\",P5+一体形LED!$I37/10000)","v":0}]