{"text_format":"1","workbook":"xlsx","n_sheets":4,"sheets":["交換形LED","DATA","ｸﾞﾗﾌ","Sheet1"],"not_rendered":{"charts":1,"images":44,"macros":1,"external_links":0,"defined_names":68,"comments":0,"pivot_tables":0},"unopened":[],"bounds":{"document_bytes":16777216,"sheet_cells":100000,"rows_first":2000,"rows_last":500,"rows_between":2000,"halvings":0,"cell_chars":16384,"cell_head_chars":4096},"cells_cut":0,"cells_raw":0,"read":"whole","date_system":"1900"}

{"sheet":"交換形LED","index":0,"n_rows":75,"n_cols":12,"rows_kept":75,"cut":false,"hidden":false,"merged":[[53,4,55,4],[36,4,36,5],[38,0,38,1],[38,6,38,7],[36,0,36,1],[36,6,36,7],[38,4,38,5],[52,2,52,3],[0,0,0,11],[9,6,9,7],[9,0,9,1],[2,0,2,5],[2,6,2,11],[1,0,1,11],[7,0,8,1],[7,2,8,5],[7,6,8,7],[7,8,8,11],[4,1,5,4],[10,8,10,9],[10,10,10,11],[10,2,13,5],[32,0,32,1],[24,0,24,1],[16,0,16,1],[15,0,15,1],[30,0,30,1],[28,0,28,1],[16,10,16,11],[34,0,34,1],[34,6,34,7],[11,6,12,6],[17,6,17,7],[14,0,14,1],[26,0,26,1],[17,0,17,1],[18,0,21,1],[26,6,26,7],[11,0,12,1],[16,6,16,7],[30,6,30,7],[32,6,32,7],[15,6,15,7],[14,6,14,7],[39,8,39,9],[18,6,21,7],[24,6,24,7],[28,6,28,7],[45,2,45,3]]}
["省エネ計算ツール【交換形ＬＥＤベース器具(連続調光形)】"]
["従来の蛍光灯器具と交換形ＬＥＤベース器具（連続調光形)の省エネ試算ができます。目安としてご活用ください。"]
["従来の蛍光灯器具",null,null,null,null,null,"交換形ＬＥＤベース器具"]
["■従来の蛍光灯器具を選んでください。↓（枠内から選択）",null,null,null,null,null,"■おすすめの交換形ＬＥＤベース器具です。"]
[null,"▼",null,null,null,null,"特長","●ＬＥＤ光源ユニットが交換可能"]
[null,null,null,null,null,"※1",null,"　　用途に合わせて明るさ・光色を変更可能"]
["　★(H)タイプを選択すると高照度タイプの交換型LED器具が選択できます。",null,null,null,null,null,null,"●日立独自の「らくづけバネ」でかんたん取り付け"]
["品　　名",null,{"$f":"IF((VLOOKUP(品名,DATA!$A$4:$AD$102,1,0))=\"▼\",\"\",VLOOKUP(品名,DATA!$A$4:$AD$102,1,0))","v":""},null,null,null,"品　　名",null,{"$f":"IF((VLOOKUP(品名,DATA!$A$4:$AD$102,18,0))=\"\",\"\",VLOOKUP(品名,DATA!$A$4:$AD$102,18,0))","v":""}]
[]
["形　　式",null,{"$f":"IF(VLOOKUP(品名,DATA!$A$4:$AD$102,2,0)=\"\",\"\",(VLOOKUP(品名,DATA!$A$4:$AD$102,2,0)))","v":""},null,null,null,"形　　式",null,{"$f":"IF(VLOOKUP(品名,DATA!$A$4:$AD$102,19,0)=\"\",\"\",VLOOKUP(品名,DATA!$A$4:$AD$102,19,0))","v":""}]
[null,null,"-",null,null,null,null,null,"<価格（税別）>",null,"<購入価格(税別)>※2"]
["価　格\n（税別）",null,null,null,null,null,"価　格\n（税別）","器具",{"$f":"IF((VLOOKUP(品名,DATA!$A$4:$AD$102,22,0))=\"\",0,VLOOKUP(品名,DATA!$A$4:$AD$102,22,0))","v":0}," 円",0," 円"]
[null,null,null,null,null,null,null,"光源ﾕﾆｯﾄ",{"$f":"IF((VLOOKUP(品名,DATA!$A$4:$AD$102,23,0))=\"\",0,VLOOKUP(品名,DATA!$A$4:$AD$102,23,0))","v":0}," 円",0," 円"]
[null,null,null,null,null,null,null,"合計",{"$f":"SUM(I12:I13)","v":0}," 円",{"$f":"SUM(K12:K13)","v":0}," 円"]
["全光束 ※3",null,{"$f":"IF((VLOOKUP(品名,DATA!$A$4:$AD$102,11,0))=\"\",\"\",VLOOKUP(品名,DATA!$A$4:$AD$102,11,0))","v":""}," lm",null,null,"器具光束 ※4",null,{"$f":"IF((VLOOKUP(品名,DATA!$A$4:$AD$102,28,0))=\"\",\"\",VLOOKUP(品名,DATA!$A$4:$AD$102,28,0))","v":""}," lm"]
["定格消費電力 ※5",null,{"$f":"IF((VLOOKUP(品名,DATA!$A$4:$AD$102,8,0))=\"\",\"\",VLOOKUP(品名,DATA!$A$4:$AD$102,8,0))","v":""}," W",{"$f":"IF((VLOOKUP(品名,DATA!$A$4:$AD$102,13,0))=\"\",\"\",VLOOKUP(品名,DATA!$A$4:$AD$102,13,0))","v":""},{"$f":"IF((VLOOKUP(品名,DATA!$A$4:$AD$102,9,0))=\"\",\"\",VLOOKUP(品名,DATA!$A$4:$AD$102,9,0))","v":""},"定格消費電力 ※5",null,{"$f":"IF((VLOOKUP(品名,DATA!$A$4:$AD$102,25,0))=\"\",\"\",VLOOKUP(品名,DATA!$A$4:$AD$102,25,0))","v":""}," W",{"$f":"IF((VLOOKUP(品名,DATA!$A$4:$AD$102,30,0))=\"\",\"\",VLOOKUP(品名,DATA!$A$4:$AD$100,30,0))","v":""},{"$f":"IF((VLOOKUP(品名,DATA!$A$4:$AD$102,26,0))=\"\",\"\",VLOOKUP(品名,DATA!$A$4:$AD$102,26,0))","v":""}]
["消費効率",null,{"$f":"IF(C15=\"\",\"\",ROUND(C15/C16,1))","v":""}," lm/W",null,null,"消費効率",null,{"$f":"IF(I15=\"\",\"\",ROUNDDOWN(I15/I16,1))","v":""}," lm/W","固有エネルギー消費効率"]
["ランプ定格寿命",null,{"$f":"IF((VLOOKUP(品名,DATA!$A$4:$AD$102,10,0))=\"\",\"\",VLOOKUP(品名,DATA!$A$4:$AD$102,10,0))","v":""}," 時間",null,null,"光束維持時間 ※6",null,{"$f":"IF((VLOOKUP(品名,DATA!$A$4:$AD$102,27,0))=\"\",\"\",VLOOKUP(品名,DATA!$A$4:$AD$102,27,0))","v":""}," 時間"]
["外観",null,null,null,null,null,"外観"]
[]
[]
[]
["■試算条件を入力ください。（枠内に入力ください）",null,null,null,null,null,"■試算条件を入力ください。（枠内に入力ください）"]
[]
["　使用台数",null,1," 台",null,null,"　使用台数",null,1," 台"]
[]
["　電力料金 ※7",null,31," 円/kWh(税込)","＊任意に変更ができます。",null,"　電力料金 ※8",null,{"$f":"C27","v":31}," 円/kWh(税込)"]
[]
["　1日の点灯時間",null,10," 時間/日",null,null,"　1日の点灯時間",null,{"$f":"C29","v":10}," 時間/日"]
[]
["　年間使用日数",null,300," 日/年　",null,null,"　年間使用日数",null,{"$f":"C31","v":300}," 日/年"]
[]
["　年間点灯時間",null,{"$f":"C29*C31","v":3000}," 時間/年　　※8",null,null,"　年間点灯時間",null,{"$f":"I29*I31","v":3000}," 時間/年"]
[]
["　年間消費電力",null,{"$f":"IF(C16=\"\",0,IF(F16=\"\",C16*C25*C33/1000,F16*C25*C33/1000))","v":0}," kWh/年",null,null,"　年間消費電力",null,{"$f":"IF(I16=\"\",0,IF(L16=\"\",I16*I25*I33/1000,L16*I25*I33/1000))","v":0}," kWh/年"]
[]
["　ランニングコスト",null,{"$f":"IFERROR($C$16*$C$25*$C$27*$C$33/1000,\"\")","v":""}," 円/年(税込)",null,null,"　ランニングコスト",null,{"$f":"IFERROR($I$16*$I$25*$I$27*$I$33/1000,\"\")","v":""}," 円/年(税込)",null,{"$f":"IF(OR(K37=\"-\",K37=0),\"\",IF(K37<0,\"低減\",\"アップ\"))","v":""}]
["　　＊ランニングコスト＝年間電力費"]
["　消費税率",null,10,"％",null,null,"　イニシャルコスト",null,{"$f":"IF(I14=0,0,IF(K14=0,I14*I25,K14*I25))*((100+$C$39)/100)","v":0}," 円（税込）",null,{"$f":"IF(OR(K39=\"-\",K39=0),\"\",IF(K39<0,\"低減\",\"アップ\"))","v":""}]
[null,null,null,null,null,null,null,null,{"$f":"IF(I14=0,\"\",IF(K14=0,\"●積算見積価格の試算です！\",\"●購入価格の試算です！\"))","v":""}]
[]
[]
[]
["■試算結果（税込価格での試算になります）"]
["　【結果１】　ランニングコスト比較"]
[null,null,"ランニングコスト（税込）",null,"比較"]
[null,"蛍光灯",{"$f":"IF(C37=\"\",0,ROUND(C37,0))","v":0}," 円/年",{"$f":"IF(C47=0,\"-\",100%)","v":"-"}]
[null,"ＬＥＤ",{"$f":"IF(I37=\"\",0,ROUND(I37,0))","v":0}," 円/年",{"$f":"IF(OR(C47=0,C48=0),\"-\",IF((C48/C47)<0,ROUNDDOWN((C48/C47),2),ROUNDUP((C48/C47),2)))","v":"-"}]
[null,"差額",{"$f":"C48-C47","v":0}," 円/年",{"$f":"IF(OR(C47=0,C49=0),\"-\",IF((C49/C47)<0,ROUNDDOWN((C49/C47),2),ROUNDUP((C49/C47),2)))","v":"-"}]
[null,{"$f":"IF(OR(C49=0,C49>0),\"\",\"●ＬＥＤなら年間 \"&TEXT(-C49,\"#,##0\")&\"円 お得です！\")","v":""},null,null,null,null,null,null,null,0]
[]
["　【結果２】　イニシャルコスト比較（設備費用）と設備償却"]
[null,null,"イニシャルコスト（税込）",null,"設備償却"]
[null,"蛍光灯",{"$f":"IF(C38=\"\",0,ROUND(C38,0))","v":0}," 円",{"$f":"IF(OR($C$37=0,$I$37=0,$C$56=0),\"-\",IF(($C$39-$I$39)/-($C$37-$I$37)<0,\"-\",ROUNDUP(($C$39-$I$39)/-($C$37-$I$37),1)))","v":"-"}]
[null,"ＬＥＤ",{"$f":"IF(I39=\"\",0,ROUND(I39,0))","v":0}," 円"]
[null,"差額",{"$f":"IF(C54=\"\",0,C55-C54)","v":0}," 円",null,"＊設備償却=イニシャルコスト差額÷ランニングコスト差額"]
["　＊イニシャルコストの償却期間は、従来の照明器具費とＬＥＤ照明器具費の差額を、ランニングコストの差額で割り試算しています。　試算条件によっては、"]
["　　「一般社団法人日本照明工業会 ガイド111」による適正交換時期や耐用の限度を超える場合がありますが、寿命を保証するものではありません。"]
[]
["※1 従来の蛍光灯器具を選択すると、同等の明るさのLED照明器具と比較できます。"]
{"$rows_left_out":16}
{"sheet":"DATA","index":1,"n_rows":112,"n_cols":31,"rows_kept":112,"cut":false,"hidden":true,"merged":[[1,17,1,29],[1,0,1,15]]}
["【DATE】"]
["従来器具",null,null,null,null,null,null,null,null,null,null,null,null,null,null,null,null,"提案ＬＥＤ器具"]
["従来品名","表示形式","従来形式","従来画像","従来器具","従来ランプ","合計","定格消費電力","平均消費電力","定格寿命","全光束","消費効率","照度補正の場合","灯数","交換費@","ランプ@",null,"提案ＬＥＤ","提案表示形式","提案形式","提案画像","器具","ランプ","合計","定格消費電力","平均消費電力","定格寿命","定格光束","消費効率","照度補正の場合"]
["▼",null,"KUHAKU",null,null,null,null,null,null,null,null,null,null,null,null,null,null,null,null,"KUHAKULED",null,null,null,null,null,null,null,null,null,null,"※消費効率を小数点１位以下切捨てに変更（2015/7）"]
["FLR40W1灯　ﾗﾋﾟｯﾄﾞ式　逆富士形(幅120mm)","NM4103-DH","NM4103DH",null,8900,580,{"$f":"SUM(E5:F5)","v":9480},46,null,12000,2850,{"$f":"K5/H5","v":61.956521739130437},null,1,200,580,null,"LED40形（FHF32形1灯定格出力 昼白色）\n 逆富士形（幅160mm） 連続調光・固定出力兼用形","NC4A1+CE402NE-X14A","NC4A1",null,4000,26300,{"$f":"SUM(V5:W5)","v":30300},13.7,null,40000,2200,{"$f":"ROUNDDOWN(AB5/Y5,1)","v":160.5}]
["FHF32W1灯 定格出力 逆富士形(幅100mm)","HNM4105V-MEN14","HNM4105VMEN14",null,8900,1400,{"$f":"SUM(E6:F6)","v":10300},34,null,12000,3340,{"$f":"K6/H6","v":98.235294117647058},null,1,200,{"$f":"F6/N6","v":1400},null,"LED40形（FHF32形1灯定格出力 昼白色）\n 逆富士形（幅160mm） 連続調光・固定出力兼用形","NC4A1+CE402NE-X14A","NC4A1",null,4000,26300,30300,13.7,null,40000,2200,{"$f":"ROUNDDOWN(AB6/Y6,1)","v":160.5}]
["FHF32W1灯 定格出力 逆富士形(幅100mm)\n 照度補正形","HNM4105V-PKN14","HNM4105VP",null,15400,1400,16800,34,29,12000,3340,98.235294117647058,"平均消費電力",1,200,1400,null,"LED40形（FHF32形1灯定格出力 昼白色）\n 逆富士形（幅160mm）　連続調光・固定出力兼用形","NC4A1+CE402NE-X14A","NC4A1",null,4000,26300,30300,13.7,null,40000,2200,{"$f":"ROUNDDOWN(AB7/Y7,1)","v":160.5}]
["FHF32W1灯 高出力 逆富士形(幅100mm)","HNM4105V-MEU14","HNM4105VMEU14",null,11400,1400,12800,45,null,12000,4530,100.66666666666667,null,1,200,1400,null,"LED40形（FHF32形1灯高出力 昼白色）\n 逆富士形（幅160mm）　連続調光・固定出力兼用形","NC4A1+CE403NF-X14A","NC4A1",null,4000,26800,30800,18.7,null,40000,3000,160.4]
["FHF32W1灯 高出力 逆富士形(幅100mm)\n 照度補正形","HNM4105V-PKU14","HNM4105VP",null,17400,1400,18800,45,38,12000,4670,103.77777777777777,"平均消費電力",1,200,1400,null,"LED40形（FHF32形1灯高出力 昼白色）\n 逆富士形（幅160mm） 連続調光・固定出力兼用形","NC4A1+CE403NF-X14A","NC4A1",null,4000,26800,30800,18.7,null,40000,3000,{"$f":"ROUNDDOWN(AB9/Y9,1)","v":160.4}]
["FHF32W2灯 定格出力 逆富士形(幅160mm)","HNM4205V-MEN14","HNM4205VMEN14",null,12500,2800,15300,65,null,12000,6690,102.92307692307692,null,2,200,1400,null,"LED40形（FHF32形2灯定格出力 昼白色）\n 逆富士形（幅160mm） 連続調光・固定出力兼用形","NC4A1+CE404NE-X14A","NC4A1",null,4000,28900,32900,27.5,null,40000,4400,{"$f":"ROUNDDOWN(AB10/Y10,1)","v":160}]
["FHF32W2灯 定格出力 逆富士形(幅160mm)\n 照度補正形","HNM4205V-PKN14","HNM4205VP",null,17500,2800,20300,65,55,12000,6690,102.92307692307692,"平均消費電力",2,200,1400,null,"LED40形（FHF32形2灯定格出力 昼白色）\n 逆富士形（幅160mm） 連続調光・固定出力兼用形","NC4A1+CE404NE-X14A","NC4A1",null,4000,28900,32900,27.5,null,40000,4400,160]
["FHF32W2灯 定格出力(H) 逆富士形(幅160mm)","HNM4205V-MEN14","HNM4205VMEN14",null,12500,2800,15300,65,null,12000,6690,102.92307692307692,null,2,200,1400,null,"LED40形（FHF32形2灯定格出力(H) 昼白色）\n 逆富士形（幅160mm） 連続調光・固定出力兼用形","NC4A1+CE405NE-X14A","NC4A1",null,4000,32900,36900,31.9,null,40000,5200,163]
["FHF32W2灯 定格出力(H) 逆富士形(幅160mm)\n 照度補正形","HNM4205V-PKN14","HNM4205VP",null,17500,2800,20300,65,55,12000,6690,102.92307692307692,"平均消費電力",2,200,1400,null,"LED40形（FHF32形2灯定格出力(H) 昼白色）\n 逆富士形（幅160mm） 連続調光・固定出力兼用形","NC4A1+CE405NE-X14A","NC4A1",null,4000,32900,36900,31.9,null,40000,5200,163]
["FHF32W2灯 高出力 逆富士形(幅160mm)","HNM4205V-MEU14","HNM4205VMEU14",null,16500,2800,{"$f":"SUM(E14:F14)","v":19300},88,null,12000,9070,{"$f":"K14/H14","v":103.06818181818181},null,2,200,1400,null,"LED40形（FHF32形2灯高出力 昼白色）\n 逆富士形（幅160mm） 連続調光・固定出力兼用形","NC4A1+CE406NE-X14A","NC4A1",null,4000,36300,{"$f":"SUM(V14:W14)","v":40300},37.4,null,40000,6000,160.4]
["FHF32W2灯 高出力 逆富士形(幅160mm)\n 照度補正形","HNM4205V-PKU14","HNM4205VP",null,19500,2800,22300,88,75,12000,9350,106.25,"平均消費電力",2,200,1400,null,"LED40形（FHF32形2灯高出力 昼白色）\n 逆富士形（幅160mm） 連続調光・固定出力兼用形","NC4A1+CE406NE-X14A","NC4A1",null,4000,36300,{"$f":"SUM(V15:W15)","v":40300},37.4,null,40000,6000,160.4]
["FHF32W2灯 高出力(H) 逆富士形(幅160mm)","HNM4205V-MEU14","HNM4205VMEU14",null,16500,2800,{"$f":"SUM(E16:F16)","v":19300},88,null,12000,9070,{"$f":"K16/H16","v":103.06818181818181},null,2,200,1400,null,"LED40形（FHF32形2灯高出力(H) 昼白色）\n 逆富士形（幅160mm） 連続調光・固定出力兼用形","NC4A1+CE407NE-X14A","NC4A1",null,4000,37500,{"$f":"SUM(V16:W16)","v":41500},43.6,null,40000,7000,160.5]
["FHF32W2灯 高出力(H) 逆富士形(幅160mm)\n 照度補正形","HNM4205V-PKU14","HNM4205VP",null,19500,2800,{"$f":"SUM(E17:F17)","v":22300},88,75,12000,9350,{"$f":"K17/H17","v":106.25},"平均消費電力",2,200,1400,null,"LED40形（FHF32形2灯高出力(H) 昼白色）\n 逆富士形（幅160mm） 連続調光・固定出力兼用形","NC4A1+CE407NE-X14A","NC4A1",null,4000,37500,{"$f":"SUM(V17:W17)","v":41500},43.6,null,40000,7000,160.5]
["FHF32W1灯 定格出力 逆富士形(幅120mm)　","HNM4103V-MEN14","HNM4103V",null,8900,1400,10300,34,null,12000,3340,98.235294117647058,null,1,200,1400,null,"LED40形（FHF32形1灯定格出力 昼白色）\n 逆富士形（幅160mm） 連続調光・固定出力兼用形","NC4A1+CE402NE-X14A","NC4A1",null,4000,26300,30300,13.7,null,40000,2200,160.5]
["FHF32W1灯 定格出力 逆富士形(幅120mm)　\n 照度補正形","HNM4103V-PKN14","HNM4103V",null,15400,1400,16800,34,29,12000,3340,98.235294117647058,"平均消費電力",1,200,1400,null,"LED40形（FHF32形1灯定格出力 昼白色）\n 逆富士形（幅160mm） 連続調光・固定出力兼用形","NC4A1+CE402NE-X14A","NC4A1",null,4000,26300,30300,13.7,null,40000,2200,160.5]
["FHF32W1灯 高出力 逆富士形(幅120mm)","HNM4103V-MEU14","HNM4103V",null,11400,1400,12800,45,null,12000,4670,103.77777777777777,null,1,200,1400,null,"LED40形（FHF32形1灯高出力 昼白色）\n 逆富士形（幅160mm） 連続調光・固定出力兼用形","NC4A1+CE403NF-X14A","NC4A1",null,4000,26800,30800,18.7,null,40000,3000,160.4]
["FHF32W1灯 高出力 逆富士形(幅120mm)\n 照度補正形","HNM4103V-PKU14","HNM4103V",null,17400,1400,18800,45,38,12000,4670,103.77777777777777,"平均消費電力",1,200,1400,null,"LED40形（FHF32形1灯高出力 昼白色）\n 逆富士形（幅160mm） 連続調光・固定出力兼用形","NC4A1+CE403NF-X14A","NC4A1",null,4000,26800,30800,18.7,null,40000,3000,160.4]
["FLR40W2灯 ﾗﾋﾟｯﾄﾞ式 逆富士形(幅200mm)","NM4203-DSC","NM4203DSC",null,12500,1160,13660,85,null,12000,5520,64.941176470588232,null,2,200,580,null,"LED40形（FLR40形2灯定格出力 昼白色）\n 逆富士形（幅230mm） 連続調光・固定出力兼用形","NC4B1+CE403NE-X14A","NC4B1",null,4200,27500,31700,23.7,null,40000,3800,160.30000000000001]
["FHF32W2灯 定格出力 逆富士形(幅200mm)","HNM4203V-MEN14","HNM4203VMEN14",null,12500,2800,15300,65,null,12000,6690,102.92307692307692,null,2,200,1400,null,"LED40形（FHF32形2灯定格出力 昼白色）\n 逆富士形（幅230mm） 連続調光・固定出力兼用形","NC4B1+CE404NE-X14A","NC4B1",null,4200,28900,33100,27.5,null,40000,4400,160]
["FHF32W2灯 定格出力 逆富士形(幅200mm)\n 照度補正形","HNM4203V-PKN14","HNM4203V",null,17500,2800,20300,65,55,12000,6690,102.92307692307692,"平均消費電力",2,200,1400,null,"LED40形（FHF32形2灯定格出力 昼白色）\n 逆富士形（幅230mm） 連続調光・固定出力兼用形","NC4B1+CE404NE-X14A","NC4B1",null,4200,28900,33100,27.5,null,40000,4400,160]
["FHF32W2灯 定格出力(H) 逆富士形(幅200mm)","HNM4203V-MEN14","HNM4203VMEN14",null,12500,2800,{"$f":"SUM(E25:F25)","v":15300},65,null,12000,6690,102.92307692307692,null,2,200,1400,null,"LED40形（FHF32形2灯定格出力(H) 昼白色）\n 逆富士形（幅230mm） 連続調光・固定出力兼用形","NC4B1+CE405NE-X14A","NC4B1",null,4200,32900,37100,31.9,null,40000,5200,163]
["FHF32W2灯 定格出力(H) 逆富士形(幅200mm)\n 照度補正形","HNM4203V-PKN14","HNM4203V",null,17500,2800,20300,65,55,12000,6690,102.92307692307692,"平均消費電力",2,200,1400,null,"LED40形（FHF32形2灯定格出力(H) 昼白色）\n 逆富士形（幅230mm） 連続調光・固定出力兼用形","NC4B1+CE405NE-X14A","NC4B1",null,4200,32900,37100,31.9,null,40000,5200,163]
["FHF32W2灯 高出力 逆富士形(幅200mm)　","HNM4203V-MEU14","HNM4203V",null,16500,2800,19300,88,null,12000,9350,106.25,null,2,200,1400,null,"LED40形（FHF32形2灯高出力 昼白色）\n 逆富士形（幅230mm） 連続調光・固定出力兼用形","NC4B1+CE406NE-X14A","NC4B1",null,4200,36300,{"$f":"SUM(V27:W27)","v":40500},37.4,null,40000,6000,160.4]
["FHF32W2灯 高出力 逆富士形(幅200mm)　\n 照度補正形","HNM4203V-PKU14","HNM4203V",null,19500,2800,22300,88,75,12000,9350,106.25,"平均消費電力",2,200,1400,null,"LED40形（FHF32形2灯高出力 昼白色）\n 逆富士形（幅230mm） 連続調光・固定出力兼用形","NC4B1+CE406NE-X14A","NC4B1",null,4200,36300,{"$f":"SUM(V28:W28)","v":40500},37.4,null,40000,6000,160.4]
["FHF32W2灯 高出力(H) 逆富士形(幅200mm)　","HNM4203V-MEU14","HNM4203V",null,16500,2800,{"$f":"SUM(E29:F29)","v":19300},88,null,12000,9350,106.25,null,2,200,1400,null,"LED40形（FHF32形2灯高出力(H) 昼白色）\n 逆富士形（幅230mm） 連続調光・固定出力兼用形","NC4B1+CE407NE-X14A","NC4B1",null,4200,37500,{"$f":"SUM(V29:W29)","v":41700},43.6,null,40000,7000,160.5]
["FHF32W2灯 高出力(H) 逆富士形(幅200mm)\n 照度補正形","HNM4203V-PKU14","HNM4203V",null,19500,2800,22300,88,75,12000,9350,106.25,"平均消費電力",2,200,1400,null,"LED40形（FHF32形2灯高出力(H) 昼白色）\n 逆富士形（幅230mm） 連続調光・固定出力兼用形","NC4B1+CE407NE-X14A","NC4B1",null,4200,37500,{"$f":"SUM(V30:W30)","v":41700},43.6,null,40000,7000,160.5]
["FLR40W1灯　ﾗﾋﾟｯﾄﾞ式　トラフ形","PM4118S-DH","PM4118SDH",null,8100,580,8680,46,null,12000,2850,{"$f":"K31/H31","v":61.956521739130437},null,1,200,{"$f":"F31/N31","v":580},null,"LED40形（FHF32形1灯定格出力 昼白色）\n トラフ形　連続調光・固定出力兼用形","PC4A1+CE402NE-X14A","PC4A1",null,4000,26300,{"$f":"SUM(V31:W31)","v":30300},13.7,null,40000,2200,160.5]
["FHF32W1灯 定格出力 トラフ形","HPM4105V-MEN14","HPM4105VMEN14",null,8100,1400,9500,34,null,12000,3340,98.235294117647058,null,1,200,1400,null,"LED40形（FHF32形1灯定格出力 昼白色）\n トラフ形　連続調光・固定出力兼用形","PC4A1+CE402NE-X14A","PC4A1",null,4000,26300,30300,13.7,null,40000,2200,160.5]
["FHF32W1灯 定格出力 トラフ形\n 照度補正形","HPM4105V-PKN14","HPM4105VMEN14",null,14800,1400,16200,34,29,12000,3340,98.235294117647058,"平均消費電力",1,200,1400,null,"LED40形（FHF32形1灯定格出力 昼白色）\n トラフ形 連続調光・固定出力兼用形","PC4A1+CE402NE-X14A","PC4A1",null,4000,26300,30300,13.7,null,40000,2200,160.5]
["FHF32W1灯 高出力 トラフ形","HPM4105V-MEU14","HPM4105VMEU14",null,10800,1400,12200,45,null,12000,4530,100.66666666666667,null,1,200,1400,null,"LED40形（FHF32形1灯高出力 昼白色）\n トラフ形 連続調光・固定出力兼用形","PC4A1+CE403NF-X14A","PC4A1",null,4000,26800,30800,18.7,null,40000,3000,160.4]
["FHF32W1灯 高出力 トラフ形\n 照度補正形","HPM4105V-PKU14","HPM4105VMEN14",null,16800,1400,18200,45,38,12000,4670,103.77777777777777,"平均消費電力",1,200,1400,null,"LED40形（FHF32形1灯高出力 昼白色）\n トラフ形 連続調光・固定出力兼用形","PC4A1+CE403NF-X14A","PC4A1",null,4000,26800,30800,18.7,null,40000,3000,160.4]
["FHF32W2灯 定格出力 トラフ形","HPM4205V-MEN14","HPM4205VMEN14",null,9900,2800,{"$f":"SUM(E36:F36)","v":12700},65,null,12000,6690,102.92307692307692,null,2,200,1400,null,"LED40形（FHF32形2灯定格出力 昼白色）\n トラフ形 連続調光・固定出力兼用形","PC4A1+CE404NE-X14A","PC4A1",null,4000,28900,32900,27.5,null,40000,4400,160]
["FHF32W2灯 定格出力 トラフ形\n 照度補正形","HPM4205V-PKN14","HPM4105VMEN14",null,15000,2800,17800,65,55,12000,6690,102.92307692307692,"平均消費電力",2,200,1400,null,"LED40形（FHF32形2灯定格出力 昼白色）\n トラフ形 連続調光・固定出力兼用形","PC4A1+CE404NE-X14A","PC4A1",null,4000,28900,32900,27.5,null,40000,4400,160]
["FHF32W2灯 定格出力(H) トラフ形","HPM4205V-MEN14","HPM4205VMEN14",null,9900,2800,12700,65,null,12000,6690,102.92307692307692,null,2,200,1400,null,"LED40形（FHF32形2灯定格出力(H) 昼白色）\n トラフ形 連続調光・固定出力兼用形","PC4A1+CE405NE-X14A","PC4A1",null,4000,32900,36900,31.9,null,40000,5200,163]
["FHF32W2灯 定格出力(H) トラフ形\n 照度補正形","HPM4205V-PKN14","HPM4205V",null,15000,2800,17800,65,55,12000,6690,102.92307692307692,"平均消費電力",2,200,1400,null,"LED40形（FHF32形2灯定格出力(H) 昼白色）\n トラフ形 連続調光・固定出力兼用形","PC4A1+CE405NE-X14A","PC4A1",null,4000,32900,36900,31.9,null,40000,5200,163]
["FHF32W2灯 高出力 トラフ形","HPM4205V-MEU14","HPM4205V",null,14000,2800,16800,88,null,12000,9350,106.25,null,2,200,1400,null,"LED40形（FHF32形2灯高出力 昼白色）\n トラフ形 連続調光・固定出力兼用形","PC4A1+CE406NE-X14A","PC4A1",null,4000,36300,40300,37.4,null,40000,6000,160.4]
["FHF32W2灯 高出力 トラフ形\n 照度補正形","HPM4205V-PKU14","HPM4205V",null,17000,2800,19800,88,75,12000,9350,106.25,"平均消費電力",2,200,1400,null,"LED40形（FHF32形2灯高出力 昼白色）\n トラフ形 連続調光・固定出力兼用形","PC4A1+CE406NE-X14A","PC4A1",null,4000,36300,40300,37.4,null,40000,6000,160.4]
["FHF32W2灯 高出力(H) トラフ形","HPM4205V-MEU14","HPM4205V",null,14000,2800,{"$f":"SUM(E42:F42)","v":16800},88,null,12000,9350,106.25,null,2,200,1400,null,"LED40形（FHF32形2灯高出力(H) 昼白色）\n トラフ形 連続調光・固定出力兼用形","PC4A1+CE407NE-X14A","PC4A1",null,4000,37500,41500,43.6,null,40000,7000,160.5]
["FHF32W2灯 高出力(H) トラフ形\n 照度補正形","HPM4205V-PKU14","HPM4205V",null,17000,2800,19800,88,75,12000,9350,106.25,"平均消費電力",2,200,1400,null,"LED40形（FHF32形2灯高出力(H) 昼白色）\n トラフ形 連続調光・固定出力兼用形","PC4A1+CE407NE-X14A","PC4A1",null,4000,37500,41500,43.6,null,40000,7000,160.5]
["FLR40W1灯　ﾗﾋﾟｯﾄﾞ式　笠付形","PK4118S-DH","PK4118SDH",null,8500,580,9080,46,null,12000,2850,61.956521739130437,null,1,200,580,null,"LED40形（FHF32形1灯定格出力 昼白色）\n 笠付形 連続調光・固定出力兼用形","PC4B1+CE402NE-X14A","PC4B1",null,4600,26300,30900,13.7,null,40000,2160,157.6]
["FHF32W1灯 定格出力 笠付形","HNK4105V-MEN14","HNK4105VMEN14",null,8500,1400,9900,34,null,12000,3340,98.235294117647058,null,1,200,1400,null,"LED40形（FHF32形1灯定格出力 昼白色）\n 笠付形 連続調光・固定出力兼用形","PC4B1+CE402NE-X14A","PC4B1",null,4600,26300,30900,13.7,null,40000,2160,157.6]
["FHF32W1灯 定格出力 笠付形\n 照度補正形","HNK4105V-PKN14","HNK4105VP",null,15300,1400,16700,34,29,12000,3340,98.235294117647058,"平均消費電力",1,200,1400,null,"LED40形（FHF32形1灯定格出力 昼白色）\n 笠付形 連続調光・固定出力兼用形","PC4B1+CE402NE-X14A","PC4B1",null,4600,26300,{"$f":"SUM(V46:W46)","v":30900},13.7,null,40000,2160,157.6]
["FHF32W1灯 高出力 笠付形","HNK4105V-MEU14","HNK4105VMEU14",null,11300,1400,12700,45,null,12000,4530,100.66666666666667,null,1,200,1400,null,"LED40形（FHF32形1灯高出力 昼白色）\n 笠付形 連続調光・固定出力兼用形","PC4B1+CE403NF-X14A","PC4B1",null,4600,26800,31400,18.7,null,40000,2940,157.19999999999999]
["FHF32W1灯 高出力 笠付形\n 照度補正形","HNK4105V-PKU14","HNK4105VP",null,17300,1400,18700,45,38,12000,4670,103.77777777777777,"平均消費電力",1,200,1400,null,"LED40形（FHF32形1灯高出力 昼白色）\n 笠付形 連続調光・固定出力兼用形","PC4B1+CE403NF-X14A","PC4B1",null,4600,26800,{"$f":"SUM(V48:W48)","v":31400},18.7,null,40000,2940,157.19999999999999]
["FLR40W2灯　ﾗﾋﾟｯﾄﾞ式　笠付形","PK4223S-DSC","PK4223SDSC",null,10100,1160,11260,85,null,12000,5700,67.058823529411768,null,2,200,{"$f":"F49/N49","v":580},null,"LED40形（FLR40形2灯定格出力 昼白色）\n 笠付形 連続調光・固定出力兼用形","PC4B1+CE403NE-X14A","PC4B1",null,4600,27500,{"$f":"SUM(V49:W49)","v":32100},23.7,null,40000,3730,157.30000000000001]
["FHF32W2灯 定格出力 笠付形","HNK4205V-MEN14","HNK4205VMEN14",null,10100,2800,{"$f":"SUM(E50:F50)","v":12900},65,null,12000,6690,102.92307692307692,null,2,200,1400,null,"LED40形（FHF32形2灯定格出力 昼白色）\n 笠付形 連続調光・固定出力兼用形","PC4B1+CE404NE-X14A","PC4B1",null,4600,27500,32100,27.5,null,40000,4320,157]
["FHF32W2灯 定格出力 笠付形\n 照度補正形","HNK4205V-PKN14","HNK4205VP",null,17500,2800,20300,65,55,12000,6690,102.92307692307692,"平均消費電力",2,200,1400,null,"LED40形（FHF32形2灯定格出力 昼白色）\n 笠付形 連続調光・固定出力兼用形","PC4B1+CE404NE-X14A","PC4B1",null,4600,28900,{"$f":"SUM(V51:W51)","v":33500},27.5,null,40000,4320,157]
["FHF32W2灯 定格出力(H) 笠付形","HNK4205V-MEN14","HNK4205VMEN14",null,10100,2800,12900,65,null,12000,6690,102.92307692307692,null,2,200,1400,null,"LED40形（FHF32形2灯定格出力 昼白色）\n 笠付形 連続調光・固定出力兼用形","PC4B1+CE405NE-X14A","PC4B1",null,4600,32900,{"$f":"SUM(V52:W52)","v":37500},31.9,null,40000,5100,159.80000000000001]
["FHF32W2灯 定格出力(H) 笠付形\n 照度補正形","HNK4205V-PKN14","HNK4205VP",null,17500,2800,20300,65,55,12000,6690,102.92307692307692,"平均消費電力",2,200,{"$f":"F53/N53","v":1400},null,"LED40形（FHF32形2灯定格出力 昼白色）\n 笠付形 連続調光・固定出力兼用形","PC4B1+CE405NE-X14A","PC4B1",null,4600,32900,{"$f":"SUM(V53:W53)","v":37500},31.9,null,40000,5100,159.80000000000001]
["FHF32W2灯 高出力 笠付形","HNK4205V-MEU14","HNK4205VMEU14",null,14500,2800,17300,88,null,12000,9070,103.06818181818181,null,2,200,1400,null,"LED40形（FHF32形2灯高出力 昼白色）\n 笠付形 連続調光・固定出力兼用形","PC4B1+CE406NE-X14A","PC4B1",null,4600,36300,40900,37.4,null,40000,5890,157.4]
["FHF32W2灯 高出力 笠付形\n 照度補正形","HNK4205V-PKU14","HNK4205VP",null,19500,2800,22300,88,75,12000,9350,106.25,"平均消費電力",2,200,1400,null,"LED40形（FHF32形2灯高出力 昼白色）\n 笠付形　連続調光・固定出力兼用形","PC4B1+CE406NE-X14A","PC4B1",null,4600,36300,{"$f":"SUM(V55:W55)","v":40900},37.4,null,40000,5890,157.4]
["FHF32W2灯 高出力(H) 笠付形","HNK4205V-MEU14","HNK4205VMEU14",null,14500,2800,17300,88,null,12000,9070,103.06818181818181,null,2,200,1400,null,"LED40形（FHF32形2灯高出力(H) 昼白色）\n 笠付形 連続調光・固定出力兼用形","PC4B1+CE407NE-X14A","PC4B1",null,4600,37500,{"$f":"SUM(V56:W56)","v":42100},43.6,null,40000,6870,157.5]
["FHF32W2灯 高出力(H) 笠付形\n 照度補正形","HNK4205V-PKU14","HNK4205VP",null,19500,2800,22300,88,75,12000,9350,106.25,"平均消費電力",2,200,1400,null,"LED40形（FHF32形2灯高出力(H) 昼白色）\n 笠付形　連続調光・固定出力兼用形","PC4B1+CE407NE-X14A","PC4B1",null,4600,37500,{"$f":"SUM(V57:W57)","v":42100},43.6,null,40000,6870,157.5]
["FHF32W2灯 定格出力 直付開放形","HNM4223V-EN14","HNM4223V",null,18000,2800,20800,65,null,12000,6690,102.92307692307692,null,2,200,1400,null,"LED40形（FHF32形2灯定格出力 昼白色）\n 直付開放形 連続調光・固定出力兼用形","NC4C1+CE404NE-X14A","NC4C1",null,11200,28900,40100,27.5,null,40000,4290,156]
["FHF32W2灯 定格出力 直付開放形\n 照度補正形","HNM4223V-PKN14","HNM4223V",null,23100,2800,25900,65,55,12000,6650,102.30769230769231,"平均消費電力",2,200,1400,null,"LED40形（FHF32形2灯定格出力 昼白色）\n 直付開放形 連続調光・固定出力兼用形","NC4C1+CE404NE-X14A","NC4C1",null,11200,28900,{"$f":"SUM(V59:W59)","v":40100},27.5,null,40000,4290,156]
["FHF32W2灯 定格出力(H) 直付開放形","HNM4223V-EN14","HNM4223V",null,18000,2800,20800,65,null,12000,6690,102.92307692307692,null,2,200,1400,null,"LED40形（FHF32形2灯定格出力(H) 昼白色）\n 直付開放形 連続調光・固定出力兼用形","NC4C1+CE405NE-X14A","NC4C1",null,11200,32900,{"$f":"SUM(V60:W60)","v":44100},31.9,null,40000,5060,158.6]
{"$rows_left_out":53}
{"sheet":"ｸﾞﾗﾌ","index":2,"n_rows":5,"n_cols":17,"rows_kept":5,"cut":false,"hidden":true,"merged":[]}
[]
[]
["使用年数",0,1,2,3,4,5,6,7,8,9,10,11,12,13,14,15]
["蛍光灯",0,{"$f":"IF(交換形LED!$C37=\"\",\"\",B4+交換形LED!$C37/10000)","v":""},{"$f":"IF(交換形LED!$C37=\"\",\"\",C4+交換形LED!$C37/10000)","v":""},{"$f":"IF(交換形LED!$C37=\"\",\"\",D4+交換形LED!$C37/10000)","v":""},{"$f":"IF(交換形LED!$C37=\"\",\"\",E4+交換形LED!$C37/10000)","v":""},{"$f":"IF(交換形LED!$C37=\"\",\"\",F4+交換形LED!$C37/10000)","v":""},{"$f":"IF(交換形LED!$C37=\"\",\"\",G4+交換形LED!$C37/10000)","v":""},{"$f":"IF(交換形LED!$C37=\"\",\"\",H4+交換形LED!$C37/10000)","v":""},{"$f":"IF(交換形LED!$C37=\"\",\"\",I4+交換形LED!$C37/10000)","v":""},{"$f":"IF(交換形LED!$C37=\"\",\"\",J4+交換形LED!$C37/10000)","v":""},{"$f":"IF(交換形LED!$C37=\"\",\"\",K4+交換形LED!$C37/10000)","v":""},{"$f":"IF(交換形LED!$C37=\"\",\"\",L4+交換形LED!$C37/10000)","v":""},{"$f":"IF(交換形LED!$C37=\"\",\"\",M4+交換形LED!$C37/10000)","v":""},{"$f":"IF(交換形LED!$C37=\"\",\"\",N4+交換形LED!$C37/10000)","v":""},{"$f":"IF(交換形LED!$C37=\"\",\"\",O4+交換形LED!$C37/10000)","v":""},{"$f":"IF(交換形LED!$C37=\"\",\"\",P4+交換形LED!$C37/10000)","v":""}]
["LED",{"$f":"IF(交換形LED!I39=\"\",\"\",交換形LED!I39/10000)","v":0},{"$f":"IF(交換形LED!$I37=\"\",\"\",B5+交換形LED!$I37/10000)","v":""},{"$f":"IF(交換形LED!$I37=\"\",\"\",C5+交換形LED!$I37/10000)","v":""},{"$f":"IF(交換形LED!$I37=\"\",\"\",D5+交換形LED!$I37/10000)","v":""},{"$f":"IF(交換形LED!$I37=\"\",\"\",E5+交換形LED!$I37/10000)","v":""},{"$f":"IF(交換形LED!$I37=\"\",\"\",F5+交換形LED!$I37/10000)","v":""},{"$f":"IF(交換形LED!$I37=\"\",\"\",G5+交換形LED!$I37/10000)","v":""},{"$f":"IF(交換形LED!$I37=\"\",\"\",H5+交換形LED!$I37/10000)","v":""},{"$f":"IF(交換形LED!$I37=\"\",\"\",I5+交換形LED!$I37/10000)","v":""},{"$f":"IF(交換形LED!$I37=\"\",\"\",J5+交換形LED!$I37/10000)","v":""},{"$f":"IF(交換形LED!$I37=\"\",\"\",K5+交換形LED!$I37/10000)","v":""},{"$f":"IF(交換形LED!$I37=\"\",\"\",L5+交換形LED!$I37/10000)","v":""},{"$f":"IF(交換形LED!$I37=\"\",\"\",M5+交換形LED!$I37/10000)","v":""},{"$f":"IF(交換形LED!$I37=\"\",\"\",N5+交換形LED!$I37/10000)","v":""},{"$f":"IF(交換形LED!$I37=\"\",\"\",O5+交換形LED!$I37/10000)","v":""},{"$f":"IF(交換形LED!$I37=\"\",\"\",P5+交換形LED!$I37/10000)","v":""}]

{"sheet":"Sheet1","index":3,"n_rows":0,"n_cols":0,"rows_kept":0,"cut":false,"hidden":true,"merged":[]}